Move debug server to it's own package

38 jobs for debug-server-refactorization in 46 minutes and 48 seconds (queued for 4 seconds)
Status Job ID Name Coverage
  Prebuild
passed #176410012
clone test repo

00:01:01

passed #176410019
dep check

00:01:12

passed #176410010
docker
helper images

00:07:24

manual #176410013
allowed to fail manual
review-docs-deploy
passed #176410017
gitlab-org
tests definitions

00:02:19

 
  Test
passed #176410020
code_quality

00:01:33

passed #176410063
git 1.7.1

00:01:43

passed #176410022
docker
unit test 1/5

00:10:13

passed #176410029
docker
unit test 2/5

00:09:33

passed #176410031
docker
unit test 3/5

00:05:04

passed #176410032
docker
unit test 4/5

00:02:15

passed #176410034
docker
unit test 5/5

00:03:17

failed #176410036
docker allowed to fail
unit test with race 1/5

00:05:09

failed #176410038
docker allowed to fail
unit test with race 2/5

00:10:28

failed #176410040
docker allowed to fail
unit test with race 3/5

00:05:52

passed #176410044
docker allowed to fail
unit test with race 4/5

00:03:01

failed #176410045
docker allowed to fail
unit test with race 5/5

00:03:28

failed #176410046
windows-1803 shell allowed to fail
windows 1803 tests 1/3

00:15:32

failed #176410050
windows-1803 shell allowed to fail
windows 1803 tests 2/3

00:29:59

failed #176410051
windows-1803 shell allowed to fail
windows 1803 tests 3/3

00:00:04

failed #176410055
windows-1809 shell allowed to fail
windows 1809 tests 1/3

00:14:37

failed #176410058
windows-1809 shell allowed to fail
windows 1809 tests 2/3

00:00:04

failed #176410062
windows-1809 shell allowed to fail
windows 1809 tests 3/3

00:08:36

 
  Coverage
passed #176410068
race conditions detector

00:00:59

passed #176410067
test coverage report

00:01:06

57.9%
passed #176410070
test junit report

00:01:15

 
  Build
passed #176410074
gitlab-org
binaries darwin/386 darwin/amd64

00:02:01

passed #176410077
gitlab-org
binaries freebsd/386 freebsd/amd64 freebsd/arm

00:02:22

passed #176410083
gitlab-org
binaries linux/386 linux/amd64 linux/arm

00:02:15

passed #176410085
gitlab-org
binaries windows/386 windows/amd64

00:02:08

 
  Package
passed #176410087
gitlab-org
package-deb

00:02:28

passed #176410088
gitlab-org
package-rpm

00:02:29

 
  Release
passed #176410089
release
development S3

00:01:16

passed #176410090
docker
development docker images

00:03:14

passed #176410091
windows-1803 shell
development nanoserver1803 helper docker image

00:02:57

passed #176410092
windows-1809 shell
development nanoserver1809 helper docker image

00:02:50

failed #176410093
static QA

00:00:42

 
  Cleanup
skipped #176410094
allowed to fail manual
review-docs-cleanup
 
Name Stage Failure
failed
unit test with race 5/5 Test
coverage: 6.9% of statements
ok gitlab.com/gitlab-org/gitlab-runner/shells 1.080s
make: *** [parallel_test_execute] Error 1
Makefile:134: recipe for target 'parallel_test_execute' failed
Uploading artifacts...
.cover/*: found 9 matching files
.testoutput/*: found 9 matching files
Uploading artifacts to coordinator... ok id=176410045 responseStatus=201 Created token=vq3yThqd
ERROR: Job failed: exit code 1
failed
unit test with race 1/5 Test
coverage: 31.6% of statements
ok gitlab.com/gitlab-org/gitlab-runner/common 1.139s
make: *** [parallel_test_execute] Error 1
Makefile:134: recipe for target 'parallel_test_execute' failed
Uploading artifacts...
.cover/*: found 12 matching files
.testoutput/*: found 12 matching files
Uploading artifacts to coordinator... ok id=176410036 responseStatus=201 Created token=4ykYcNV1
ERROR: Job failed: exit code 1
failed
unit test with race 2/5 Test
exit status 1
FAIL gitlab.com/gitlab-org/gitlab-runner/executors/docker/machine 0.090s
make: *** [parallel_test_execute] Error 1
Makefile:134: recipe for target 'parallel_test_execute' failed
Uploading artifacts...
.cover/*: found 12 matching files
.testoutput/*: found 12 matching files
Uploading artifacts to coordinator... ok id=176410038 responseStatus=201 Created token=mDWi5vuS
ERROR: Job failed: exit code 1
failed
windows 1809 tests 1/3 Test

WARNING: Failed packages:
WARNING: gitlab.com/gitlab-org/gitlab-runner/executors/docker-2
gitlab.com/gitlab-org/gitlab-runner/executors/docker-4


Running after script...
$ if (Test-Path $PKG_BUILD_DIR) { $(Get-Item $PKG_BUILD_DIR).Delete() }
ERROR: Job failed: exit status 1
failed
windows 1803 tests 3/3 Test
At C:\windows\TEMP\build_script198524946\script.ps1:185 char:3
+ Remove-Item -Force -Recurse "C:\GitLab-Runner\builds\cveTTzy8\2\git ...
+ ~~~~~~~~~~~~~~~~~~~~~~~~~~~~~~~~~~~~~~~~~~~~~~~~~~~~~~~~~~~~~~~~~~~
+ CategoryInfo : NotSpecified: (:) [Remove-Item], Win32Exception
+ FullyQualifiedErrorId : System.ComponentModel.Win32Exception,Microsoft.PowerShell.Commands.RemoveItemCommand

Cloning repository...
fatal: destination path 'C:/GitLab-Runner/builds/cveTTzy8/2/gitlab-org/gitlab-runner' already exists and is not an empty directory.
ERROR: Job failed: exit status 1
failed
unit test with race 3/5 Test
coverage: 52.2% of statements
ok gitlab.com/gitlab-org/gitlab-runner/helpers 1.029s
Makefile:134: recipe for target 'parallel_test_execute' failed
make: *** [parallel_test_execute] Error 1
Uploading artifacts...
.cover/*: found 12 matching files
.testoutput/*: found 12 matching files
Uploading artifacts to coordinator... ok id=176410040 responseStatus=201 Created token=Dfs1L7os
ERROR: Job failed: exit code 1
failed
windows 1803 tests 1/3 Test
WARNING: Failed packages:
WARNING: gitlab.com/gitlab-org/gitlab-runner/commands/helpers-1
gitlab.com/gitlab-org/gitlab-runner/executors/docker-2
gitlab.com/gitlab-org/gitlab-runner/executors/docker-4


Running after script...
$ if (Test-Path $PKG_BUILD_DIR) { $(Get-Item $PKG_BUILD_DIR).Delete() }
ERROR: Job failed: exit status 1
failed
windows 1809 tests 2/3 Test
At C:\windows\TEMP\build_script782588578\script.ps1:185 char:3
+ Remove-Item -Force -Recurse "C:\GitLab-Runner\builds\neqbZyJL\1\git ...
+ ~~~~~~~~~~~~~~~~~~~~~~~~~~~~~~~~~~~~~~~~~~~~~~~~~~~~~~~~~~~~~~~~~~~
+ CategoryInfo : NotSpecified: (:) [Remove-Item], Win32Exception
+ FullyQualifiedErrorId : System.ComponentModel.Win32Exception,Microsoft.PowerShell.Commands.RemoveItemCommand

Cloning repository...
fatal: destination path 'C:/GitLab-Runner/builds/neqbZyJL/1/gitlab-org/gitlab-runner' already exists and is not an empty directory.
ERROR: Job failed: exit status 1
failed
windows 1809 tests 3/3 Test
ok  	gitlab.com/gitlab-org/gitlab-runner/shells	3.955s

WARNING: Failed packages:
WARNING: gitlab.com/gitlab-org/gitlab-runner/helpers/docker-0


Running after script...
$ if (Test-Path $PKG_BUILD_DIR) { $(Get-Item $PKG_BUILD_DIR).Delete() }
ERROR: Job failed: exit status 1
failed
windows 1803 tests 2/3 Test
gitlab.com/gitlab-org/gitlab-runner/executors/shell-1

gitlab.com/gitlab-org/gitlab-runner/executors/shell-2
gitlab.com/gitlab-org/gitlab-runner/helpers/archives-0
gitlab.com/gitlab-org/gitlab-runner/helpers/archives-1


Running after script...
$ if (Test-Path $PKG_BUILD_DIR) { $(Get-Item $PKG_BUILD_DIR).Delete() }
ERROR: Job failed: exit status 1
failed
static QA Release
    "categories": [
"Style"
],
"engine_name": "golint",
"fingerprint": "14af87ae240ad7698536f60843132483",
"severity": "minor"
}
]
ERROR: Job failed: exit code 1