Update CHANGELOG for v11.8.0

33 jobs for v11.8.0 in 50 minutes and 3 seconds (queued for 1 second)
latest
Status Job ID Name Coverage
  Prebuild
passed #165757531
clone test repo

00:00:54

passed #165757533
dep check

00:01:29

passed #165757530
docker
helper images

00:02:53

passed #165757532
gitlab-org
tests definitions

00:01:50

 
  Test
passed #165757534
code_quality

00:01:01

passed #165787837
git 1.7.1

00:02:36

failed #165757545
integration windows allowed to fail
integration windows

00:00:01

passed #165757535
docker
unit test 1/5

00:08:02

passed #165757536
docker
unit test 2/5

00:14:13

passed #165757537
docker
unit test 3/5

00:04:22

passed #165757538
docker
unit test 4/5

00:02:00

passed #165757539
docker
unit test 5/5

00:02:50

passed #165757540
docker allowed to fail
unit test with race 1/5

00:10:13

failed #165757541
docker allowed to fail
unit test with race 2/5

00:14:49

failed #165757542
docker allowed to fail
unit test with race 3/5

00:05:17

passed #165757543
docker allowed to fail
unit test with race 4/5

00:02:11

failed #165757544
docker allowed to fail
unit test with race 5/5

00:02:52

failed #165757546
git 1.7.1

00:02:35

failed #165785125
git 1.7.1

00:02:02

failed #165786551
git 1.7.1

00:02:51

 
  Coverage
passed #165757548
race conditions detector

00:01:10

passed #165757547
test coverage report

00:01:04

55.9%
passed #165757549
test junit report

00:01:11

 
  Build
passed #165757550
gitlab-org
binaries darwin/386 darwin/amd64

00:01:44

passed #165757551
gitlab-org
binaries freebsd/386 freebsd/amd64 freebsd/arm

00:01:58

passed #165757552
gitlab-org
binaries linux/386 linux/amd64 linux/arm

00:02:06

passed #165757553
gitlab-org
binaries windows/386 windows/amd64

00:01:48

 
  Package
passed #165757554
gitlab-org
package-deb

00:02:08

passed #165757555
gitlab-org
package-rpm

00:01:32

 
  Release
passed #165757556
release
stable S3

00:01:11

passed #165757558
release
stable docker images

00:03:07

passed #165757557
release
stable packagecloud

00:24:13

passed #165757559
static QA

00:00:39

 
Name Stage Failure
failed
integration windows Test
+   Remove-Item -Force -Recurse "c:\gitlab-runner\builds\7816523a\0\gitlab-org\git ...
+ ~~~~~~~~~~~~~~~~~~~~~~~~~~~~~~~~~~~~~~~~~~~~~~~~~~~~~~~~~~~~~~~~~~~~~~~~~~~~~~~~
+ CategoryInfo : WriteError: (C:\gitlab-runne...g\gitlab-runner:String) [Remove-Item], DirectoryNotFoundE
xception
+ FullyQualifiedErrorId : RemoveItemIOError,Microsoft.PowerShell.Commands.RemoveItemCommand

Cloning repository...
fatal: destination path 'c:/gitlab-runner/builds/7816523a/0/gitlab-org/gitlab-runner' already exists and is not an empty directory.
ERROR: Job failed: exit status 1
failed
unit test with race 3/5 Test
coverage: 3.7% of statements
ok gitlab.com/gitlab-org/gitlab-runner/executors/virtualbox 1.048s
Makefile:134: recipe for target 'parallel_test_execute' failed
make: *** [parallel_test_execute] Error 1
Uploading artifacts...
.cover/*: found 11 matching files
.testoutput/*: found 11 matching files
Uploading artifacts to coordinator... ok id=165757542 responseStatus=201 Created token=FRgV3-qR
ERROR: Job failed: exit code 1
failed
unit test with race 5/5 Test
coverage: 14.3% of statements
ok gitlab.com/gitlab-org/gitlab-runner/shells 1.058s
Makefile:134: recipe for target 'parallel_test_execute' failed
make: *** [parallel_test_execute] Error 1
Uploading artifacts...
.cover/*: found 9 matching files
.testoutput/*: found 9 matching files
Uploading artifacts to coordinator... ok id=165757544 responseStatus=201 Created token=CdYBxqrm
ERROR: Job failed: exit code 1
failed
unit test with race 2/5 Test
coverage: 35.7% of statements
ok gitlab.com/gitlab-org/gitlab-runner/executors/docker/machine 1.063s
Makefile:134: recipe for target 'parallel_test_execute' failed
make: *** [parallel_test_execute] Error 1
Uploading artifacts...
.cover/*: found 11 matching files
.testoutput/*: found 11 matching files
Uploading artifacts to coordinator... ok id=165757541 responseStatus=201 Created token=es6Q-nrU
ERROR: Job failed: exit code 1