Correct quoting/highlighting of text.

Status Job ID Name Coverage
  Prebuild
passed #163514326
clone test repo

00:01:13

passed #163514331
dep check

00:01:39

passed #163514324
docker
helper images

00:04:56

manual #163514327
allowed to fail manual
review-docs-deploy
passed #163514329
gitlab-org
tests definitions

00:01:54

 
  Test
passed #163514332
code_quality

00:01:19

passed #163514348
git 1.7.1

00:02:06

failed #163514346
windows integration allowed to fail
integration windows

00:00:01

passed #163514333
docker
unit test 1/5

00:03:35

passed #163514334
docker
unit test 2/5

00:14:25

passed #163514336
docker
unit test 3/5

00:04:31

passed #163514337
docker
unit test 4/5

00:03:50

passed #163514338
docker
unit test 5/5

00:05:51

passed #163514339
docker allowed to fail
unit test with race 1/5

00:04:17

failed #163514341
docker allowed to fail
unit test with race 2/5

00:15:55

failed #163514342
docker allowed to fail
unit test with race 3/5

00:12:21

passed #163514343
docker allowed to fail
unit test with race 4/5

00:04:26

failed #163514344
docker allowed to fail
unit test with race 5/5

00:03:27

 
  Coverage
passed #163514352
race conditions detector

00:01:00

passed #163514350
test coverage report

00:01:00

55.8%
passed #163514354
test junit report

00:01:23

 
  Build
passed #163514355
gitlab-org
binaries darwin/386 darwin/amd64

00:01:49

passed #163514356
gitlab-org
binaries freebsd/386 freebsd/amd64 freebsd/arm

00:02:11

passed #163514357
gitlab-org
binaries linux/386 linux/amd64 linux/arm

00:02:01

passed #163514359
gitlab-org
binaries windows/386 windows/amd64

00:01:45

 
  Package
passed #163514360
gitlab-org
package-deb

00:02:13

passed #163514361
gitlab-org
package-rpm

00:01:32

 
  Release
passed #163514362
release
development S3

00:01:02

passed #163514365
docker
development docker images

00:02:50

passed #163514367
static QA

00:00:32

 
  Cleanup
manual #163514369
allowed to fail manual
review-docs-cleanup
 
Name Stage Failure
failed
unit test with race 5/5 Test
coverage: 14.3% of statements
ok gitlab.com/gitlab-org/gitlab-runner/shells 1.066s
make: *** [parallel_test_execute] Error 1
Makefile:134: recipe for target 'parallel_test_execute' failed
Uploading artifacts...
.cover/*: found 9 matching files
.testoutput/*: found 9 matching files

Uploading artifacts to coordinator... ok
id=163514344 responseStatus=201 Created token=vXLrbJ7x
ERROR: Job failed: exit code 1
failed
unit test with race 2/5 Test
coverage: 41.5% of statements
ok gitlab.com/gitlab-org/gitlab-runner/executors/docker/machine 1.070s
Makefile:134: recipe for target 'parallel_test_execute' failed
make: *** [parallel_test_execute] Error 1
Uploading artifacts...
.cover/*: found 11 matching files
.testoutput/*: found 11 matching files

Uploading artifacts to coordinator... ok
id=163514341 responseStatus=201 Created token=a_-Am94_
ERROR: Job failed: exit code 1
failed
integration windows Test
+   Remove-Item -Force -Recurse "c:\gitlab-runner\builds\7816523a\0\gitlab-org\git ...
+ ~~~~~~~~~~~~~~~~~~~~~~~~~~~~~~~~~~~~~~~~~~~~~~~~~~~~~~~~~~~~~~~~~~~~~~~~~~~~~~~~
+ CategoryInfo : WriteError: (C:\gitlab-runne...g\gitlab-runner:String) [Remove-Item], DirectoryNotFoundE
xception
+ FullyQualifiedErrorId : RemoveItemIOError,Microsoft.PowerShell.Commands.RemoveItemCommand

Cloning repository...
fatal: destination path 'c:/gitlab-runner/builds/7816523a/0/gitlab-org/gitlab-runner' already exists and is not an empty directory.
ERROR: Job failed: exit status 1
failed
unit test with race 3/5 Test
coverage: 3.7% of statements
ok gitlab.com/gitlab-org/gitlab-runner/executors/virtualbox 1.051s
Makefile:134: recipe for target 'parallel_test_execute' failed
make: *** [parallel_test_execute] Error 1
Uploading artifacts...
.cover/*: found 11 matching files
.testoutput/*: found 11 matching files

Uploading artifacts to coordinator... ok
id=163514342 responseStatus=201 Created token=c1CnD_FZ
ERROR: Job failed: exit code 1