Refactor application initialization

30 jobs for refactor-app-initialization in 48 minutes and 20 seconds (queued for 1 second)
latest
Status Job ID Name Coverage
  Prebuild
passed #105144184
clone test repo

00:01:18

passed #105144183
docker
helper images

00:04:33

manual #105144185
allowed to fail manual
review-docs-deploy
passed #105144186
gitlab-org
tests definitions

00:02:44

 
  Test
passed #105144187
code_quality

00:05:42

passed #105144202
docs check links

00:00:26

passed #105144205
git 1.7.1

00:02:12

failed #105144203
integration windows allowed to fail
integration windows

00:00:01

passed #105144188
docker
unit tests 0 5

00:18:47

passed #105144189
docker
unit tests 1 5

00:11:32

passed #105144190
docker
unit tests 2 5

00:08:49

passed #105144191
docker
unit tests 3 5

00:03:37

passed #105144192
docker
unit tests 4 5

00:11:43

failed #105144193
docker allowed to fail
unit tests with race 0 5

00:10:10

failed #105144195
docker allowed to fail
unit tests with race 1 5

00:12:19

passed #105144197
docker allowed to fail
unit tests with race 2 5

00:10:38

passed #105144198
docker allowed to fail
unit tests with race 3 5

00:04:16

failed #105144200
docker allowed to fail
unit tests with race 4 5

00:13:01

 
  Coverage
passed #105144208
race conditions detector

00:01:13

passed #105144206
test coverage report

00:00:30

55.1%
 
  Build
passed #105144209
gitlab-org
binaries darwin/386 darwin/amd64

00:03:26

passed #105144211
gitlab-org
binaries freebsd/386 freebsd/amd64 freebsd/arm

00:17:22

passed #105144212
gitlab-org
binaries linux/386 linux/amd64 linux/arm

00:04:43

passed #105144213
gitlab-org
binaries windows/386 windows/amd64

00:03:45

 
  Package
passed #105144214
gitlab-org
package-deb

00:01:58

passed #105144215
gitlab-org
package-rpm

00:02:01

 
  Release
passed #105144216
release
development S3

00:01:20

passed #105144217
docker
development docker images

00:04:22

passed #105144218
static QA

00:02:09

 
  Cleanup
manual #105144219
allowed to fail manual
review-docs-cleanup
 
Name Stage Failure
failed
unit tests with race 0 5 Test
coverage: 36.8% of statements
ok gitlab.com/gitlab-org/gitlab-runner/common 1.091s
Makefile:133: recipe for target 'parallel_test_execute' failed
make: *** [parallel_test_execute] Error 1
Uploading artifacts...
.cover/*: found 11 matching files
.testoutput/*: found 11 matching files
Uploading artifacts to coordinator... ok id=105144193 responseStatus=201 Created token=suE91zGB
ERROR: Job failed: exit code 1
failed
unit tests with race 4 5 Test
coverage: 14.4% of statements
ok gitlab.com/gitlab-org/gitlab-runner/shells 1.060s
Makefile:133: recipe for target 'parallel_test_execute' failed
make: *** [parallel_test_execute] Error 1
Uploading artifacts...
.cover/*: found 7 matching files
.testoutput/*: found 7 matching files
Uploading artifacts to coordinator... ok id=105144200 responseStatus=201 Created token=jXfjK8TF
ERROR: Job failed: exit code 1
failed
integration windows Test
+   Remove-Item -Force -Recurse "c:\gitlab-runner\builds\7816523a\0\gitlab-org\git ...
+ ~~~~~~~~~~~~~~~~~~~~~~~~~~~~~~~~~~~~~~~~~~~~~~~~~~~~~~~~~~~~~~~~~~~~~~~~~~~~~~~~
+ CategoryInfo : WriteError: (C:\gitlab-runne...g\gitlab-runner:String) [Remove-Item], DirectoryNotFoundE
xception
+ FullyQualifiedErrorId : RemoveItemIOError,Microsoft.PowerShell.Commands.RemoveItemCommand

Cloning repository...
fatal: destination path 'c:/gitlab-runner/builds/7816523a/0/gitlab-org/gitlab-runner' already exists and is not an empty directory.
ERROR: Job failed: exit status 1
failed
unit tests with race 1 5 Test
exit status 1
FAIL gitlab.com/gitlab-org/gitlab-runner/executors/docker/machine 0.101s
Makefile:133: recipe for target 'parallel_test_execute' failed
make: *** [parallel_test_execute] Error 1
Uploading artifacts...
.cover/*: found 11 matching files
.testoutput/*: found 11 matching files
Uploading artifacts to coordinator... ok id=105144195 responseStatus=201 Created token=tq-7_-yD
ERROR: Job failed: exit code 1