Merge branch 'docs-update-session-server' into 'master'

fix example for session_server and added the note about where this section should be placed

See merge request !1035
31 jobs for master in 28 minutes and 35 seconds (queued for 2 seconds)
Status Job ID Name Coverage
  Prebuild
passed #102607810
clone test repo

00:01:08

passed #102607809
docker
helper images

00:04:04

manual #102607812
allowed to fail manual
review-docs-deploy
passed #102607814
gitlab-org
tests definitions

00:02:24

 
  Test
passed #102607815
code_quality

00:01:09

passed #102607827
docs check links

00:00:42

passed #102607829
git 1.7.1

00:01:56

failed #102607828
windows integration allowed to fail
integration windows

00:00:01

passed #102607816
docker
unit tests 0 5

00:06:02

passed #102607818
docker
unit tests 1 5

00:09:44

passed #102607819
docker
unit tests 2 5

00:07:28

passed #102607820
docker
unit tests 3 5

00:03:05

passed #102607821
docker
unit tests 4 5

00:03:37

passed #102607822
docker allowed to fail
unit tests with race 0 5

00:06:35

failed #102607823
docker allowed to fail
unit tests with race 1 5

00:09:46

failed #102607824
docker allowed to fail
unit tests with race 2 5

00:07:38

passed #102607825
docker allowed to fail
unit tests with race 3 5

00:04:40

failed #102607826
docker allowed to fail
unit tests with race 4 5

00:04:18

 
  Coverage
passed #102607832
race conditions detector

00:01:04

passed #102607831
test coverage report

00:01:09

53.9%
 
  Build
passed #102607833
gitlab-org
binaries darwin/386 darwin/amd64

00:03:48

passed #102607834
gitlab-org
binaries freebsd/386 freebsd/amd64 freebsd/arm

00:04:53

passed #102607835
gitlab-org
binaries linux/386 linux/amd64 linux/arm

00:04:46

passed #102607836
gitlab-org
binaries windows/386 windows/amd64

00:03:56

 
  Package
passed #102607837
gitlab-org
package-deb

00:01:54

passed #102607840
gitlab-org
package-rpm

00:02:11

 
  Release
passed #102607841
release
bleeding edge S3

00:01:23

passed #102607843
release
bleeding edge docker images

00:03:14

passed #102607842
release
bleeding edge packagecloud

00:06:23

passed #102607844
static QA

00:00:35

 
  Cleanup
manual #102607845
allowed to fail manual
review-docs-cleanup
 
Name Stage Failure
failed
unit tests with race 1 5 Test
coverage: 43.7% of statements
ok gitlab.com/gitlab-org/gitlab-runner/executors/docker/machine 1.051s
Makefile:133: recipe for target 'parallel_test_execute' failed
make: *** [parallel_test_execute] Error 1
Uploading artifacts...
.cover/*: found 11 matching files
.testoutput/*: found 11 matching files

Uploading artifacts to coordinator... ok
id=102607823 responseStatus=201 Created token=vuza57fk
ERROR: Job failed: exit code 1
failed
integration windows Test
+   Remove-Item -Force -Recurse "c:\gitlab-runner\builds\7816523a\0\gitlab-org\git ...
+ ~~~~~~~~~~~~~~~~~~~~~~~~~~~~~~~~~~~~~~~~~~~~~~~~~~~~~~~~~~~~~~~~~~~~~~~~~~~~~~~~
+ CategoryInfo : WriteError: (C:\gitlab-runne...g\gitlab-runner:String) [Remove-Item], DirectoryNotFoundE
xception
+ FullyQualifiedErrorId : RemoveItemIOError,Microsoft.PowerShell.Commands.RemoveItemCommand

Cloning repository...
fatal: destination path 'c:/gitlab-runner/builds/7816523a/0/gitlab-org/gitlab-runner' already exists and is not an empty directory.
ERROR: Job failed: exit status 1
failed
unit tests with race 4 5 Test
coverage: 14.4% of statements
ok gitlab.com/gitlab-org/gitlab-runner/shells 1.063s
Makefile:133: recipe for target 'parallel_test_execute' failed
make: *** [parallel_test_execute] Error 1
Uploading artifacts...
.cover/*: found 6 matching files
.testoutput/*: found 6 matching files

Uploading artifacts to coordinator... ok
id=102607826 responseStatus=201 Created token=SRnLeWyM
ERROR: Job failed: exit code 1
failed
unit tests with race 2 5 Test
coverage: 52.0% of statements
ok gitlab.com/gitlab-org/gitlab-runner/helpers/archives 1.050s
Makefile:133: recipe for target 'parallel_test_execute' failed
make: *** [parallel_test_execute] Error 1
Uploading artifacts...
.cover/*: found 11 matching files
.testoutput/*: found 11 matching files

Uploading artifacts to coordinator... ok
id=102607824 responseStatus=201 Created token=PTP-H5p4
ERROR: Job failed: exit code 1