Merge branch '11-3-stable'

* 11-3-stable:
  Update CHANGELOG for v11.3.0
31 jobs for master in 30 minutes and 59 seconds (queued for 1 second)
Status Job ID Name Coverage
  Prebuild
passed #100344448
clone test repo

00:00:26

passed #100344447
docker
helper images

00:04:31

manual #100344449
allowed to fail manual
review-docs-deploy
passed #100344450
gitlab-org
tests definitions

00:02:25

 
  Test
passed #100344451
code_quality

00:01:15

passed #100344462
docs check links

00:00:24

passed #100344464
git 1.7.1

00:01:41

failed #100344463
integration windows allowed to fail
integration windows

00:00:06

passed #100344452
docker
unit tests 0 5

00:05:13

passed #100344453
docker
unit tests 1 5

00:09:27

passed #100344454
docker
unit tests 2 5

00:08:36

passed #100344455
docker
unit tests 3 5

00:03:55

passed #100344456
docker
unit tests 4 5

00:03:59

failed #100344457
docker allowed to fail
unit tests with race 0 5

00:06:51

failed #100344458
docker allowed to fail
unit tests with race 1 5

00:10:47

failed #100344459
docker allowed to fail
unit tests with race 2 5

00:10:04

passed #100344460
docker allowed to fail
unit tests with race 3 5

00:04:30

failed #100344461
docker allowed to fail
unit tests with race 4 5

00:04:21

 
  Coverage
passed #100344466
race conditions detector

00:02:00

passed #100344465
test coverage report

00:00:51

53.8%
 
  Build
passed #100344467
gitlab-org
binaries darwin/386 darwin/amd64

00:03:34

passed #100344469
gitlab-org
binaries freebsd/386 freebsd/amd64 freebsd/arm

00:04:55

passed #100344470
gitlab-org
binaries linux/386 linux/amd64 linux/arm

00:04:37

passed #100344471
gitlab-org
binaries windows/386 windows/amd64

00:02:35

 
  Package
passed #100344472
gitlab-org
package-deb

00:02:14

passed #100344473
gitlab-org
package-rpm

00:02:11

 
  Release
passed #100344474
release
bleeding edge S3

00:01:16

passed #100344476
release
bleeding edge docker images

00:03:17

passed #100344475
release
bleeding edge packagecloud

00:06:27

passed #100344477
static QA

00:00:29

 
  Cleanup
manual #100344478
allowed to fail manual
review-docs-cleanup
 
Name Stage Failure
failed
unit tests with race 2 5 Test
coverage: 52.0% of statements
ok gitlab.com/gitlab-org/gitlab-runner/helpers/archives 1.058s
Makefile:133: recipe for target 'parallel_test_execute' failed
make: *** [parallel_test_execute] Error 1
Uploading artifacts...
.cover/*: found 10 matching files
.testoutput/*: found 11 matching files

Uploading artifacts to coordinator... ok
id=100344459 responseStatus=201 Created token=1zatnNsf
ERROR: Job failed: exit code 1
failed
integration windows Test
+   Remove-Item -Force -Recurse "c:\gitlab-runner\builds\7816523a\0\gitlab-org\git ...
+ ~~~~~~~~~~~~~~~~~~~~~~~~~~~~~~~~~~~~~~~~~~~~~~~~~~~~~~~~~~~~~~~~~~~~~~~~~~~~~~~~
+ CategoryInfo : WriteError: (C:\gitlab-runne...g\gitlab-runner:String) [Remove-Item], DirectoryNotFoundE
xception
+ FullyQualifiedErrorId : RemoveItemIOError,Microsoft.PowerShell.Commands.RemoveItemCommand

Cloning repository...
fatal: destination path 'c:/gitlab-runner/builds/7816523a/0/gitlab-org/gitlab-runner' already exists and is not an empty directory.
ERROR: Job failed: exit status 1
failed
unit tests with race 1 5 Test
coverage: 43.7% of statements
ok gitlab.com/gitlab-org/gitlab-runner/executors/docker/machine 1.065s
Makefile:133: recipe for target 'parallel_test_execute' failed
make: *** [parallel_test_execute] Error 1
Uploading artifacts...
.cover/*: found 11 matching files
.testoutput/*: found 11 matching files

Uploading artifacts to coordinator... ok
id=100344458 responseStatus=201 Created token=Dpg1Mqex
ERROR: Job failed: exit code 1
failed
unit tests with race 4 5 Test
coverage: 14.4% of statements
ok gitlab.com/gitlab-org/gitlab-runner/shells 1.056s
Makefile:133: recipe for target 'parallel_test_execute' failed
make: *** [parallel_test_execute] Error 1
Uploading artifacts...
.cover/*: found 6 matching files
.testoutput/*: found 6 matching files

Uploading artifacts to coordinator... ok
id=100344461 responseStatus=201 Created token=gAwSTb1r
ERROR: Job failed: exit code 1
failed
unit tests with race 0 5 Test
coverage: 36.4% of statements
ok gitlab.com/gitlab-org/gitlab-runner/common 1.090s
Makefile:133: recipe for target 'parallel_test_execute' failed
make: *** [parallel_test_execute] Error 1
Uploading artifacts...
.cover/*: found 11 matching files
.testoutput/*: found 11 matching files

Uploading artifacts to coordinator... ok
id=100344457 responseStatus=201 Created token=Hhx_xw_Z
ERROR: Job failed: exit code 1