Merge branch 'bump-go-114' into 'master'

Bump to go 1.14

See merge request !1884
56 jobs for !1884 with bump-go-114 into master in 47 minutes and 22 seconds (queued for 3 seconds)
Status Job ID Name Coverage
  Prepare
passed #455746987
docker
prepare ci image

00:01:45

 
  Prebuild
passed #455746991
clone test repo

00:01:26

passed #455746989
docker
helper images

00:07:52

passed #455746994
gitlab-org
tests definitions

00:04:29

 
  Test
passed #455747004
check feature flags docs

00:01:25

passed #455747008
check mocks

00:03:36

passed #455747006
check modules

00:01:36

passed #455747009
code_quality

00:02:06

passed #455747002
docs lint

00:01:04

passed #455747111
git 1.7.1

00:02:39

passed #455747000
license_management

00:06:20

passed #455747013
docker
unit test 1/8

00:04:16

passed #455747017
docker
unit test 2/8

00:04:00

passed #455747020
docker
unit test 3/8

00:13:33

passed #455747023
docker
unit test 4/8

00:04:25

passed #455747025
docker
unit test 5/8

00:03:13

passed #455747026
docker
unit test 6/8

00:03:27

passed #455747029
docker
unit test 7/8

00:03:00

passed #455747033
docker
unit test 8/8

00:03:11

passed #455747037
docker
unit test with race 1/8

00:04:31

passed #455747046
docker
unit test with race 2/8

00:04:31

passed #455747051
docker
unit test with race 3/8

00:13:57

failed #455747053
docker allowed to fail
unit test with race 4/8

00:04:21

passed #455747057
docker
unit test with race 5/8

00:04:33

passed #455747058
docker
unit test with race 6/8

00:03:10

passed #455747062
docker
unit test with race 7/8

00:03:57

passed #455747068
docker
unit test with race 8/8

00:03:14

failed #455747083
shell windows-1803 allowed to fail
windows 1803 tests 1/3

00:07:12

failed #455747089
shell windows-1803 allowed to fail
windows 1803 tests 2/3

00:19:47

failed #455747091
shell windows-1803 allowed to fail
windows 1803 tests 3/3

00:05:27

failed #455747093
windows-1809 windows shared-windows allowed to fail
windows 1809 tests 1/8

00:08:54

failed #455747096
windows-1809 windows shared-windows allowed to fail
windows 1809 tests 2/8

00:20:05

failed #455747098
windows-1809 windows shared-windows allowed to fail
windows 1809 tests 3/8

00:08:25

failed #455747101
windows-1809 windows shared-windows allowed to fail
windows 1809 tests 4/8

00:15:45

failed #455747103
windows-1809 windows shared-windows allowed to fail
windows 1809 tests 5/8

00:25:57

failed #455747105
windows-1809 windows shared-windows allowed to fail
windows 1809 tests 6/8

00:07:02

failed #455747108
windows-1809 windows shared-windows allowed to fail
windows 1809 tests 7/8

00:07:16

failed #455747109
windows-1809 windows shared-windows allowed to fail
windows 1809 tests 8/8

00:07:11

 
  Coverage
failed #455747115
check windows 1803 test failures

00:01:01

failed #455747118
check windows 1809 test failures

00:01:35

passed #455747114
race conditions detector

00:01:06

passed #455747112
test coverage report

00:01:25

65.1%
passed #455747113
test junit report

00:01:22

 
  Build
skipped #455747119
gitlab-org
binaries darwin/386 darwin/amd64
skipped #455747121
gitlab-org
binaries freebsd/386 freebsd/amd64 freebsd/arm
skipped #455747122
gitlab-org
binaries linux/386 linux/amd64 linux/arm linux/arm64
skipped #455747123
gitlab-org
binaries windows/386 windows/amd64
 
  Package
failed #455747124
gitlab-org
package-deb

00:01:48

failed #455747125
gitlab-org
package-rpm

00:01:09

 
  Release
skipped #455747126
release
development S3
skipped #455747128
release
development docker images
passed #455747131
shell windows-1803
development servercore1803 helper docker image

00:02:26

passed #455747135
windows-1809 windows shared-windows
development servercore1809 helper docker image

00:10:07

passed #455747138
static QA

00:00:32

 
  Docs
skipped #455747142
allowed to fail manual
review-docs-cleanup
skipped #455747141
allowed to fail manual
review-docs-deploy
 
Name Stage Failure
failed
package-deb Package
make package-deb-fpm ARCH=amd64 PACKAGE_ARCH=amd64 RUNNER_BINARY=out/binaries/gitlab-runner-linux-amd64
make[1]: Entering directory '/builds/gitlab-org/gitlab-runner'
Requiring backports/<ruby version> is deprecated. Require just the needed backports instead
Rails backports are deprecated.
{:timestamp=>"2020-03-02T10:29:20.360121+0000", :message=>"Invalid package configuration: Cannot chdir to 'out/binaries'. Does it exist?", :level=>:error}
make[1]: *** [Makefile.package.mk:30: package-deb-fpm] Error 1
make[1]: Leaving directory '/builds/gitlab-org/gitlab-runner'
make: *** [Makefile.package.mk:13: package-deb] Error 2
ERROR: Job failed: exit code 1
failed
package-rpm Package
make package-rpm-fpm ARCH=amd64 PACKAGE_ARCH=amd64 RUNNER_BINARY=out/binaries/gitlab-runner-linux-amd64
make[1]: Entering directory '/builds/gitlab-org/gitlab-runner'
Requiring backports/<ruby version> is deprecated. Require just the needed backports instead
Rails backports are deprecated.
{:timestamp=>"2020-03-02T10:28:41.849743+0000", :message=>"Invalid package configuration: Cannot chdir to 'out/binaries'. Does it exist?", :level=>:error}
make[1]: Leaving directory '/builds/gitlab-org/gitlab-runner'
make[1]: *** [Makefile.package.mk:33: package-rpm-fpm] Error 1
make: *** [Makefile.package.mk:22: package-rpm] Error 2
ERROR: Job failed: exit code 1
failed
check windows 1809 test failures Coverage
  - TestHTTPFetcher/fetch_no_remote
- TestAdvertisingAddress
- TestAdvertisingAddress/Advertising_address_not_valid_ip/domain

Please fix the new failures detected.
This job will not pass until it's done.
=========================================================================================================================

ERROR: Job failed: exit code 1
failed
windows 1809 tests 5/8 Test
GO version:   go1.8.7
Built: 2019-08-22T13:06:07+0000
OS/Arch: windows/amd64
Uploading artifacts...
Runtime platform
arch=amd64 os=windows pid=3896 revision=a987417a version=12.2.0
.testoutput/*: found 10 matching files

WARNING: Failed to load system CertPool: crypto/x509: system root pool is not available on Windows
Uploading artifacts to coordinator... ok
id=455747103 responseStatus=201 Created token=FL7okNwk
ERROR: Job failed: exit status 1
failed
check windows 1803 test failures Coverage
  - TestHTTPFetcher/fetch_no_remote
- TestAdvertisingAddress
- TestAdvertisingAddress/Advertising_address_not_valid_ip/domain

Please fix the new failures detected.
This job will not pass until it's done.
=========================================================================================================================

ERROR: Job failed: exit code 1
failed
windows 1809 tests 2/8 Test
GO version:   go1.8.7
Built: 2019-08-22T13:06:07+0000
OS/Arch: windows/amd64
Uploading artifacts...
Runtime platform
arch=amd64 os=windows pid=2932 revision=a987417a version=12.2.0
.testoutput/*: found 10 matching files

WARNING: Failed to load system CertPool: crypto/x509: system root pool is not available on Windows
Uploading artifacts to coordinator... ok
id=455747096 responseStatus=201 Created token=AdiFrrvm
ERROR: Job failed: exit status 1
failed
windows 1803 tests 2/3 Test
GO version:   go1.13.4
Built: 2019-12-22T11:55:34+0000
OS/Arch: windows/amd64
Uploading artifacts...
Runtime platform
arch=amd64 os=windows pid=71676 revision=ac8e767a version=12.6.0
.testoutput/*: found 26 matching files

WARNING: Failed to load system CertPool: crypto/x509: system root pool is not available on Windows
Uploading artifacts to coordinator... ok
id=455747089 responseStatus=201 Created token=HHA_WQBR
ERROR: Job failed: exit status 1
failed
windows 1809 tests 4/8 Test
GO version:   go1.8.7
Built: 2019-08-22T13:06:07+0000
OS/Arch: windows/amd64
Uploading artifacts...
Runtime platform
arch=amd64 os=windows pid=1608 revision=a987417a version=12.2.0
.testoutput/*: found 10 matching files

WARNING: Failed to load system CertPool: crypto/x509: system root pool is not available on Windows
Uploading artifacts to coordinator... ok
id=455747101 responseStatus=201 Created token=ngv1oQGE
ERROR: Job failed: exit status 1
failed
windows 1809 tests 1/8 Test
GO version:   go1.8.7
Built: 2019-08-22T13:06:07+0000
OS/Arch: windows/amd64
Uploading artifacts...
Runtime platform
arch=amd64 os=windows pid=4764 revision=a987417a version=12.2.0
.testoutput/*: found 10 matching files

WARNING: Failed to load system CertPool: crypto/x509: system root pool is not available on Windows
Uploading artifacts to coordinator... ok
id=455747093 responseStatus=201 Created token=yhYBsSHm
ERROR: Job failed: exit status 1
failed
windows 1809 tests 3/8 Test
GO version:   go1.8.7
Built: 2019-08-22T13:06:07+0000
OS/Arch: windows/amd64
Uploading artifacts...
Runtime platform
arch=amd64 os=windows pid=2740 revision=a987417a version=12.2.0
.testoutput/*: found 10 matching files

WARNING: Failed to load system CertPool: crypto/x509: system root pool is not available on Windows
Uploading artifacts to coordinator... ok
id=455747098 responseStatus=201 Created token=_RT9Hy2t
ERROR: Job failed: exit status 1
failed
windows 1809 tests 7/8 Test
GO version:   go1.8.7
Built: 2019-08-22T13:06:07+0000
OS/Arch: windows/amd64
Uploading artifacts...
Runtime platform
arch=amd64 os=windows pid=664 revision=a987417a version=12.2.0
.testoutput/*: found 10 matching files

WARNING: Failed to load system CertPool: crypto/x509: system root pool is not available on Windows
Uploading artifacts to coordinator... ok
id=455747108 responseStatus=201 Created token=dDVzy9p_
ERROR: Job failed: exit status 1
failed
windows 1809 tests 8/8 Test
GO version:   go1.8.7
Built: 2019-08-22T13:06:07+0000
OS/Arch: windows/amd64
Uploading artifacts...
Runtime platform
arch=amd64 os=windows pid=1848 revision=a987417a version=12.2.0
.testoutput/*: found 7 matching files

WARNING: Failed to load system CertPool: crypto/x509: system root pool is not available on Windows
Uploading artifacts to coordinator... ok
id=455747109 responseStatus=201 Created token=_UjcxyMQ
ERROR: Job failed: exit status 1
failed
windows 1803 tests 1/3 Test
GO version:   go1.13.4
Built: 2019-12-22T11:55:34+0000
OS/Arch: windows/amd64
Uploading artifacts...
Runtime platform
arch=amd64 os=windows pid=67776 revision=ac8e767a version=12.6.0
.testoutput/*: found 26 matching files

WARNING: Failed to load system CertPool: crypto/x509: system root pool is not available on Windows
Uploading artifacts to coordinator... ok
id=455747083 responseStatus=201 Created token=_YRDKMNJ
ERROR: Job failed: exit status 1
failed
windows 1809 tests 6/8 Test
GO version:   go1.8.7
Built: 2019-08-22T13:06:07+0000
OS/Arch: windows/amd64
Uploading artifacts...
Runtime platform
arch=amd64 os=windows pid=1900 revision=a987417a version=12.2.0
.testoutput/*: found 10 matching files

WARNING: Failed to load system CertPool: crypto/x509: system root pool is not available on Windows
Uploading artifacts to coordinator... ok
id=455747105 responseStatus=201 Created token=SUxECovt
ERROR: Job failed: exit status 1
failed
windows 1803 tests 3/3 Test
GO version:   go1.13.4
Built: 2019-12-22T11:55:34+0000
OS/Arch: windows/amd64
Uploading artifacts...
Runtime platform
arch=amd64 os=windows pid=71504 revision=ac8e767a version=12.6.0
.testoutput/*: found 25 matching files

WARNING: Failed to load system CertPool: crypto/x509: system root pool is not available on Windows
Uploading artifacts to coordinator... ok
id=455747091 responseStatus=201 Created token=BFLqEtkY
ERROR: Job failed: exit status 1
failed
unit test with race 4/8 Test
PASS
coverage: 63.6% of statements
ok gitlab.com/gitlab-org/gitlab-runner/executors/shell 4.271s coverage: 63.6% of statements
make: *** [Makefile:116: parallel_test_execute] Error 1
Uploading artifacts...
.cover/*: found 10 matching files
.testoutput/*: found 10 matching files

Uploading artifacts to coordinator... ok
id=455747053 responseStatus=201 Created token=PMoEvfPx
ERROR: Job failed: exit code 1