Merge branch 'patch-61' into 'master'

Improve wording in docs/development/README.md

See merge request !1837
59 jobs for !1837 with patch-61 into master in 127 minutes and 21 seconds (queued for 2 seconds)
Status Job ID Name Coverage
  Prebuild
passed #437290081
clone test repo

00:01:32

failed #440273083
docker
helper images

02:00:02

passed #437290082
gitlab-org
tests definitions

00:04:12

failed #437290079
docker
helper images

02:00:00

 
  Test
skipped #437290090
check feature flags docs
skipped #437290096
check mocks
skipped #437290093
check modules
skipped #437290100
code_quality
skipped #437290087
docs lint
skipped #437290154
git 1.7.1
skipped #437290085
allowed to fail
license_management
skipped #437290102
docker
unit test 1/8
skipped #437290105
docker
unit test 2/8
skipped #437290107
docker
unit test 3/8
skipped #437290110
docker
unit test 4/8
skipped #437290114
docker
unit test 5/8
skipped #437290117
docker
unit test 6/8
skipped #437290119
docker
unit test 7/8
skipped #437290121
docker
unit test 8/8
skipped #437290125
docker allowed to fail
unit test with race 1/8
skipped #437290126
docker allowed to fail
unit test with race 2/8
skipped #437290130
docker allowed to fail
unit test with race 3/8
skipped #437290134
docker allowed to fail
unit test with race 4/8
skipped #437290135
docker allowed to fail
unit test with race 5/8
skipped #437290137
docker allowed to fail
unit test with race 6/8
skipped #437290138
docker allowed to fail
unit test with race 7/8
skipped #437290139
docker allowed to fail
unit test with race 8/8
skipped #437290141
shell windows-1803 allowed to fail
windows 1803 tests 1/3
skipped #437290142
shell windows-1803 allowed to fail
windows 1803 tests 2/3
skipped #437290143
shell windows-1803 allowed to fail
windows 1803 tests 3/3
skipped #437290144
windows-1809 windows shared-windows allowed to fail
windows 1809 tests 1/8
skipped #437290145
windows-1809 windows shared-windows allowed to fail
windows 1809 tests 2/8
skipped #437290146
windows-1809 windows shared-windows allowed to fail
windows 1809 tests 3/8
skipped #437290148
windows-1809 windows shared-windows allowed to fail
windows 1809 tests 4/8
skipped #437290149
windows-1809 windows shared-windows allowed to fail
windows 1809 tests 5/8
skipped #437290150
windows-1809 windows shared-windows allowed to fail
windows 1809 tests 6/8
skipped #437290151
windows-1809 windows shared-windows allowed to fail
windows 1809 tests 7/8
skipped #437290153
windows-1809 windows shared-windows allowed to fail
windows 1809 tests 8/8
 
  Coverage
passed #437290158
check windows 1803 test failures

00:01:04

passed #437290159
check windows 1809 test failures

00:01:07

passed #437290157
race conditions detector

00:01:29

failed #440273085
test coverage report

00:01:36

failed #440273086
test junit report

00:01:15

failed #437290155
test coverage report

00:01:13

failed #437290156
test junit report

00:01:14

 
  Build
skipped #437290160
gitlab-org
binaries darwin/386 darwin/amd64
skipped #437290161
gitlab-org
binaries freebsd/386 freebsd/amd64 freebsd/arm
skipped #437290163
gitlab-org
binaries linux/386 linux/amd64 linux/arm linux/arm64
skipped #437290164
gitlab-org
binaries windows/386 windows/amd64
 
  Package
skipped #437290166
gitlab-org
package-deb
skipped #437290167
gitlab-org
package-rpm
 
  Release
skipped #437290169
release
development S3
skipped #437290170
release
development docker images
skipped #437290172
shell windows-1803
development servercore1803 helper docker image
skipped #437290174
windows-1809 windows shared-windows
development servercore1809 helper docker image
failed #440273087
static QA

00:00:28

failed #437290176
static QA

00:00:40

 
  Docs
skipped #437290178
allowed to fail manual
review-docs-cleanup
skipped #437290177
allowed to fail manual
review-docs-deploy
 
Name Stage Failure
failed
test coverage report Coverage
go: finding sigs.k8s.io/yaml v1.1.0
go: finding github.com/dgrijalva/jwt-go v3.2.0+incompatible
go: finding github.com/docker/spdystream v0.0.0-20160310174837-449fdfce4d96
go: finding github.com/docker/go-metrics v0.0.0-20181218153428-b84716841b82
go: finding golang.org/x/time v0.0.0-20190308202827-9d24e82272b4
go: finding k8s.io/utils v0.0.0-20190923111123-69764acb6e8e
grep: .cover/*.count.cover.txt: No such file or directory
make: *** [Makefile:120: parallel_test_coverage_report] Error 2
ERROR: Job failed: exit code 1
failed
test junit report Coverage
go: finding github.com/docker/go-metrics v0.0.0-20181218153428-b84716841b82
go: finding golang.org/x/time v0.0.0-20190308202827-9d24e82272b4
go: finding k8s.io/utils v0.0.0-20190923111123-69764acb6e8e
cat: '.testoutput/*.regular.output.txt': No such file or directory
make: *** [Makefile:124: parallel_test_junit_report] Error 1
Uploading artifacts...
WARNING: out/junit/report.xml: no matching files
ERROR: No files to upload
ERROR: Job failed: exit code 1
failed
static QA Release
 * [new tag]         v9.5.1                   -> v9.5.1
Checking out 59dafed3 as refs/merge-requests/1837/merge...

Skipping Git submodules setup
$ unset GPG_KEY
$ if [ "$(cat gl-code-quality-report.json)" != "[]" ] ; then # collapsed multi-line command
cat: can't open 'gl-code-quality-report.json': No such file or directory
jq: error: Could not open file gl-code-quality-report.json: No such file or directory
ERROR: Job failed: exit code 2
failed
helper images Prebuild The script exceeded the maximum execution time set for the job
 ---> 2f534e00893c
Step 5/8 : COPY ./scripts/ /usr/bin
---> 36b1a71acd59
Step 6/8 : COPY ./binaries/gitlab-runner-helper.x86_64 /usr/bin/gitlab-runner-helper
---> 06ce28921859
Step 7/8 : RUN echo 'hosts: files dns' >> /etc/nsswitch.conf
---> Running in 7523729f27a6
Pulling docker image gitlab/gitlab-runner-helper:x86_64-003fe500 ...
ERROR: Job failed: execution took longer than 2h0m0s seconds