Update CHANGELOG for v11.3.0

29 jobs for v11.3.0 in 45 minutes and 7 seconds (queued for 1 second)
latest
Status Job ID Name Coverage
  Prebuild
passed #100343632
clone test repo

00:00:26

passed #100343631
docker
helper images

00:04:08

passed #100343633
gitlab-org
tests definitions

00:02:19

 
  Test
passed #100343634
code_quality

00:02:46

passed #100343645
docs check links

00:00:24

passed #100343647
git 1.7.1

00:02:17

failed #100343646
integration windows allowed to fail
integration windows

00:00:01

passed #100343635
docker
unit tests 0 5

00:06:00

passed #100343636
docker
unit tests 1 5

00:09:54

passed #100343637
docker
unit tests 2 5

00:08:19

passed #100343638
docker
unit tests 3 5

00:03:54

passed #100343639
docker
unit tests 4 5

00:03:42

failed #100343640
docker allowed to fail
unit tests with race 0 5

00:05:18

failed #100343641
docker allowed to fail
unit tests with race 1 5

00:11:15

failed #100343642
docker allowed to fail
unit tests with race 2 5

00:09:24

passed #100343643
docker
unit tests with race 3 5

00:05:07

failed #100343644
docker allowed to fail
unit tests with race 4 5

00:04:08

 
  Coverage
passed #100343649
race conditions detector

00:01:01

passed #100343648
test coverage report

00:01:01

53.9%
 
  Build
passed #100343650
gitlab-org
binaries darwin/386 darwin/amd64

00:03:12

passed #100343651
gitlab-org
binaries freebsd/386 freebsd/amd64 freebsd/arm

00:05:04

passed #100343652
gitlab-org
binaries linux/386 linux/amd64 linux/arm

00:04:37

passed #100343653
gitlab-org
binaries windows/386 windows/amd64

00:03:58

 
  Package
passed #100343654
gitlab-org
package-deb

00:01:50

passed #100343655
gitlab-org
package-rpm

00:02:17

 
  Release
passed #100343656
release
stable S3

00:01:27

passed #100343658
release
stable docker images

00:03:27

passed #100343657
release
stable packagecloud

00:21:17

passed #100343659
static QA

00:00:36

 
Name Stage Failure
failed
unit tests with race 4 5 Test
coverage: 14.4% of statements
ok gitlab.com/gitlab-org/gitlab-runner/shells 1.052s
Makefile:133: recipe for target 'parallel_test_execute' failed
make: *** [parallel_test_execute] Error 1
Uploading artifacts...
.cover/*: found 6 matching files
.testoutput/*: found 6 matching files

Uploading artifacts to coordinator... ok
id=100343644 responseStatus=201 Created token=EznLz1z4
ERROR: Job failed: exit code 1
failed
integration windows Test
+   Remove-Item -Force -Recurse "c:\gitlab-runner\builds\7816523a\0\gitlab-org\git ...
+ ~~~~~~~~~~~~~~~~~~~~~~~~~~~~~~~~~~~~~~~~~~~~~~~~~~~~~~~~~~~~~~~~~~~~~~~~~~~~~~~~
+ CategoryInfo : WriteError: (C:\gitlab-runne...g\gitlab-runner:String) [Remove-Item], DirectoryNotFoundE
xception
+ FullyQualifiedErrorId : RemoveItemIOError,Microsoft.PowerShell.Commands.RemoveItemCommand

Cloning repository...
fatal: destination path 'c:/gitlab-runner/builds/7816523a/0/gitlab-org/gitlab-runner' already exists and is not an empty directory.
ERROR: Job failed: exit status 1
failed
unit tests with race 0 5 Test
coverage: 36.4% of statements
ok gitlab.com/gitlab-org/gitlab-runner/common 1.087s
Makefile:133: recipe for target 'parallel_test_execute' failed
make: *** [parallel_test_execute] Error 1
Uploading artifacts...
.cover/*: found 11 matching files
.testoutput/*: found 11 matching files

Uploading artifacts to coordinator... ok
id=100343640 responseStatus=201 Created token=apH7gnVU
ERROR: Job failed: exit code 1
failed
unit tests with race 2 5 Test
coverage: 52.0% of statements
ok gitlab.com/gitlab-org/gitlab-runner/helpers/archives 1.048s
Makefile:133: recipe for target 'parallel_test_execute' failed
make: *** [parallel_test_execute] Error 1
Uploading artifacts...
.cover/*: found 11 matching files
.testoutput/*: found 11 matching files

Uploading artifacts to coordinator... ok
id=100343642 responseStatus=201 Created token=9x6yH8os
ERROR: Job failed: exit code 1
failed
unit tests with race 1 5 Test
coverage: 43.7% of statements
ok gitlab.com/gitlab-org/gitlab-runner/executors/docker/machine 1.054s
Makefile:133: recipe for target 'parallel_test_execute' failed
make: *** [parallel_test_execute] Error 1
Uploading artifacts...
.cover/*: found 11 matching files
.testoutput/*: found 11 matching files

Uploading artifacts to coordinator... ok
id=100343641 responseStatus=201 Created token=Cg2eANCv
ERROR: Job failed: exit code 1