Add step for updating Runner helm chart

31 jobs for jlenny-HelmChart in 29 minutes and 16 seconds (queued for 1 second)
Status Job ID Name Coverage
  Prebuild
passed #96338319
clone test repo

00:01:05

passed #96338318
docker
helper images

00:03:57

manual #96338320
allowed to fail manual
review-docs-deploy
passed #96338321
gitlab-org
tests definitions

00:02:10

 
  Test
passed #96338322
code_quality

00:00:50

passed #96338333
docs check links

00:00:24

passed #96348896
git 1.7.1

00:02:12

failed #96338334
integration windows allowed to fail
integration windows

00:00:01

passed #96338323
docker
unit tests 0 5

00:04:10

passed #96338324
docker
unit tests 1 5

00:11:35

passed #96338325
docker
unit tests 2 5

00:06:06

passed #96338326
docker
unit tests 3 5

00:03:46

passed #96338327
docker
unit tests 4 5

00:04:03

passed #96338328
docker
unit tests with race 0 5

00:05:43

failed #96338329
docker allowed to fail
unit tests with race 1 5

00:12:09

failed #96338330
docker allowed to fail
unit tests with race 2 5

00:05:12

passed #96338331
docker
unit tests with race 3 5

00:04:31

failed #96338332
docker allowed to fail
unit tests with race 4 5

00:04:28

failed #96338335
git 1.7.1

00:02:05

 
  Coverage
passed #96338337
race conditions detector

00:01:03

passed #96338336
test coverage report

00:01:02

51.4%
 
  Build
passed #96338338
gitlab-org
binaries darwin/386 darwin/amd64

00:03:23

passed #96338339
gitlab-org
binaries freebsd/386 freebsd/amd64 freebsd/arm

00:04:09

passed #96338340
gitlab-org
binaries linux/386 linux/amd64 linux/arm

00:04:19

passed #96338341
gitlab-org
binaries windows/386 windows/amd64

00:03:20

 
  Package
passed #96338342
gitlab-org
package-deb

00:02:00

passed #96338343
gitlab-org
package-rpm

00:02:00

 
  Release
passed #96338344
release
development S3

00:01:15

passed #96338345
docker
development docker images

00:03:10

passed #96338346
static QA

00:00:28

 
  Cleanup
manual #96338347
allowed to fail manual
review-docs-cleanup
 
Name Stage Failure
failed
unit tests with race 1 5 Test
coverage: 16.1% of statements
ok gitlab.com/gitlab-org/gitlab-runner/executors/kubernetes 1.090s
Makefile:133: recipe for target 'parallel_test_execute' failed
make: *** [parallel_test_execute] Error 1
Uploading artifacts...
.cover/*: found 10 matching files
.testoutput/*: found 10 matching files

Uploading artifacts to coordinator... ok
id=96338329 responseStatus=201 Created token=Wz43G_F-
ERROR: Job failed: exit code 1
failed
unit tests with race 2 5 Test
coverage: 62.4% of statements
ok gitlab.com/gitlab-org/gitlab-runner/helpers/archives 1.033s
Makefile:133: recipe for target 'parallel_test_execute' failed
make: *** [parallel_test_execute] Error 1
Uploading artifacts...
.cover/*: found 10 matching files
.testoutput/*: found 10 matching files

Uploading artifacts to coordinator... ok
id=96338330 responseStatus=201 Created token=uN78-yj4
ERROR: Job failed: exit code 1
failed
integration windows Test
+   Remove-Item -Force -Recurse "c:\gitlab-runner\builds\7816523a\0\gitlab-org\git ...
+ ~~~~~~~~~~~~~~~~~~~~~~~~~~~~~~~~~~~~~~~~~~~~~~~~~~~~~~~~~~~~~~~~~~~~~~~~~~~~~~~~
+ CategoryInfo : WriteError: (C:\gitlab-runne...g\gitlab-runner:String) [Remove-Item], DirectoryNotFoundE
xception
+ FullyQualifiedErrorId : RemoveItemIOError,Microsoft.PowerShell.Commands.RemoveItemCommand

Cloning repository...
fatal: destination path 'c:/gitlab-runner/builds/7816523a/0/gitlab-org/gitlab-runner' already exists and is not an empty directory.
ERROR: Job failed: exit status 1
failed
unit tests with race 4 5 Test
coverage: 14.4% of statements
ok gitlab.com/gitlab-org/gitlab-runner/shells 1.056s
Makefile:133: recipe for target 'parallel_test_execute' failed
make: *** [parallel_test_execute] Error 1
Uploading artifacts...
.cover/*: found 7 matching files
.testoutput/*: found 7 matching files

Uploading artifacts to coordinator... ok
id=96338332 responseStatus=201 Created token=BM2K1Jog
ERROR: Job failed: exit code 1