{
  "name": "keyv",
  "dist-tags": {
    "latest": "4.0.3"
  },
  "modified": "2020-11-08T14:47:53.770Z",
  "versions": {
    "3.1.0": {
      "name": "keyv",
      "version": "3.1.0",
      "dependencies": {
        "json-buffer": "3.0.0"
      },
      "devDependencies": {
        "ava": "^0.25.0",
        "coveralls": "^3.0.0",
        "eslint-config-xo-lukechilds": "^1.0.0",
        "@keyv/mongo": "*",
        "@keyv/mysql": "*",
        "@keyv/postgres": "*",
        "@keyv/redis": "*",
        "@keyv/sqlite": "*",
        "@keyv/test-suite": "*",
        "nyc": "^11.0.3",
        "this": "^1.0.2",
        "timekeeper": "^2.0.0",
        "xo": "^0.20.1"
      },
      "dist": {
        "integrity": "sha512-9ykJ/46SN/9KPM/sichzQ7OvXyGDYKGTaDlKMGCAlg2UK8KRy4jb0d8sFc+0Tt0YYnThq8X2RZgCg74RPxgcVA==",
        "shasum": "ecc228486f69991e49e9476485a5be1e8fc5c4d9",
        "tarball": "https://registry.npmjs.org/keyv/-/keyv-3.1.0.tgz",
        "fileCount": 4,
        "unpackedSize": 14661,
        "npm-signature": "-----BEGIN PGP SIGNATURE-----\r\nVersion: OpenPGP.js v3.0.4\r\nComment: https://openpgpjs.org\r\n\r\nwsFcBAEBCAAQBQJbfIFjCRA9TVsSAnZWagAAylYP/2zYdghWdARJ2ELExwVV\nCwmegbGhsK6Y1MSoi5Uca/6VF+pgSd6kx6yXgHzBv19AXdytTo4+3+/2qZwJ\nd1pxNOKXC5tN7E+pSeNhy487SFQhmVyRgzpjhk1YuHuuaV1GeDfcb/SY0A4y\n5pQjhYt+BI0xompo2DG6O10QF0mAzTYnu8+wTzaCz2lYob4qJXvDIpmbqBU+\nPt9vutfuTQx4tdXMYqXG1C00he1kDxQvO8FyYK+ojRsJr/g8cySZoQTzi50U\nhTOBT00IoujROa9HWQwc5TmhzFLWraepDVk4Xv/ajV1c5FTWSyttlQQIy/zZ\nE08d3B5KUVz9N4j5OncB4M+dzouR8lBQqeZ8xzXQBy07tvZo21vd/y2Ct5Hd\nTSxMShnHk7591DFJjycp7hePVuIWwwyJ76+sFLwfH/ekylCE6UNnoKt34pwn\n2WmTVgBLFO3t6CU7W7qEdzWh+Fw3Cn2IrgXVDP7UdADFxMjT6QE1P4UvyQYQ\nFSygu1xcJb8oNIwMCtaQx8xObWRIkh7n799mpw3kv8QBgJ0yoNesEMg+yp/Y\nmY2NbPqEagWLnGVDVH2NoBoJrbRzYg0Ww3jI+/N2N3TL6oN2iDYUqFgvA6mS\nRsGDWR9ZRbA6+CVBcqyAdcOG/PWKKrhLSOSbqh2ZsbsiR8ZmXUpBNsA81knm\nebZA\r\n=w+Ka\r\n-----END PGP SIGNATURE-----\r\n"
      }
    }
  }
}