{
  "id": "4237065ffb64301b5835a6bfb2234f79af3f3aff",
  "short_id": "4237065f",
  "created_at": "2020-04-20T12:06:49.000+00:00",
  "parent_ids": [
    "5436f298a2c98a7e5d3481421ad95a52f8c5b812",
    "9a56febd15b20444577b6921777e7db3ecabade7"
  ],
  "title": "Commit that happened after other commit",
  "message": "This is the after commit",
  "author_name": "Example Author",
  "author_email": "author@example.org",
  "authored_date": "2020-04-20T12:06:49.000+00:00",
  "committer_name": "Example Author",
  "committer_email": "author@example.org",
  "committed_date": "2020-04-20T12:06:49.000+00:00",
  "web_url": "https://gitlab.com/gitlab-org/gitlab/-/commit/4237065ffb64301b5835a6bfb2234f79af3f3aff",
  "statistics": {
    "mainChunk": {
      "type": "special",
      "name": "main",
      "size": 7600000,
      "files": ["main.chunk.js", "main.chunk.js.map"]
    },
    "average": {
      "type": "special",
      "name": "average",
      "size": 8000000,
      "count": 264
    },
    "pages.fixture.added": {
      "name": "pages.fixture.added",
      "type": "entrypoint",
      "size": 50000,
      "assets": ["main.chunk.js", "pages.fixture.added.chunk.js"],
      "children": {},
      "childAssets": {},
      "isOverSizeLimit": true
    },
    "pages.fixture.growth": {
      "name": "pages.fixture.growth",
      "type": "entrypoint",
      "size": 1000000000,
      "assets": ["main.chunk.js", "pages.fixture.growth.chunk.js"],
      "children": {},
      "childAssets": {},
      "isOverSizeLimit": true
    },
    "pages.fixture.shrinkage": {
      "name": "pages.fixture.shrinkage",
      "type": "entrypoint",
      "size": 50000,
      "assets": ["main.chunk.js", "pages.fixture.shrinkage.chunk.js"],
      "children": {},
      "childAssets": {},
      "isOverSizeLimit": true
    },
    "pages.fixture.insignificant": {
      "name": "pages.fixture.insignificant",
      "type": "entrypoint",
      "size": 5000,
      "assets": ["main.chunk.js", "pages.fixture.insignificant.chunk.js"],
      "children": {},
      "childAssets": {},
      "isOverSizeLimit": true
    }
  }
}
