{
  "$schema": "http://iglucentral.com/schemas/com.snowplowanalytics.self-desc/schema/jsonschema/1-0-0#",
  "description": "Standard schema for a gitlab events",
  "self": {
    "vendor": "com.gitlab",
    "name": "gitlab_standard",
    "version": "1-1-1",
    "format": "jsonschema"
  },
  "type": "object",
  "additionalProperties": false,
  "required": ["environment"],
  "properties": {
    "project_id": {
      "description": "ID of the associated project",
      "type": ["integer", "null"],
      "minimum": 0,
      "maximum": 2147483647
    },
    "namespace_id": {
      "description": "ID of the associated namespace",
      "type": ["integer", "null"],
      "minimum": 0,
      "maximum": 2147483647
    },
    "user_id": {
      "description": "ID of the associated user",
      "type": ["integer", "null"],
      "minimum": 0,
      "maximum": 2147483647
    },
    "is_gitlab_team_member": {
      "description": "Indicates if triggered by a GitLab team member",
      "type": ["boolean", "null"]
    },
    "feature_enabled_by_namespace_ids": {
      "description": "List of namespaces that allow the user to use the tracked feature ",
      "type": ["array", "null"],
      "items": {
        "description": "Namespace id that have the tracked feature enabled",
        "type": "integer",
        "minimum": 0,
        "maximum": 2147483647
      }
    },
    "environment": {
      "description": "Name of the source environment, such as `production` or `staging`",
      "type": "string",
      "maxLength": 32
    },
    "source": {
      "description": "Name of the source application, such as  `gitlab-rails` or `gitlab-javascript`",
      "type": ["string", "null"],
      "maxLength": 32
    },
    "plan": {
      "description": "Name of the plan, such as  `free`, `bronze`, `silver`, `premium`, `gold` or `ultimate`",
      "type": ["string", "null"],
      "maxLength": 32
    },
    "google_analytics_id": {
      "description": "Google Analytics ID from the marketing site",
      "type": ["string", "null"],
      "maxLength": 32
    },
    "context_generated_at": {
      "description": "Timestamp indicating moment when context was generated",
      "type": ["string", "null"],
      "maxLength": 64
    },
    "realm": {
      "type": ["string", "null"],
      "description": "Self-Managed, SaaS or Dedicated",
      "enum": ["self-managed", "saas", "dedicated", null]
    },
    "instance_id": {
      "type": ["string", "null"],
      "description": "ID of the GitLab instance where the request comes from",
      "maxLength": 255
    },
    "host_name": {
      "type": ["string", "null"],
      "description": "Host name of the GitLab instance where the request comes from",
      "maxLength": 255
    },
    "instance_version": {
      "type": ["string", "null"],
      "description": "Version of the GitLab instance where the request comes from",
      "maxLength": 255
    },
    "global_user_id": {
      "type": ["string", "null"],
      "description": "Globally unique user ID",
      "maxLength": 64
    },
    "correlation_id": {
      "type": ["string", "null"],
      "description": "Unique request id for each request",
      "maxLength": 64
    },
    "extra": {
      "description": "Any additional data associated with the event, in the form of key-value pairs",
      "type": ["object", "null"]
    }
  }
}
