{
  "data": {
    "aiMessages": {
      "nodes": [
        {
          "requestId": "28e3b340-a535-4909-bd07-9542056c98bc",
          "role": "USER",
          "content": "hello duo",
          "contentHtml": "<p data-sourcepos=\"1:1-1:9\" dir=\"auto\">hello duo</p>",
          "timestamp": "2024-09-24T13:22:30Z",
          "errors": [],
          "extras": {
            "sources": null,
            "additionalContext": []
          }
        },
        {
          "requestId": "28e3b340-a535-4909-bd07-9542056c98bc",
          "role": "ASSISTANT",
          "content": "Hello! I'm GitLab Duo Chat, an AI assistant created by GitLab to help with DevSecOps-related questions and tasks. How can I assist you today? Whether you have questions about GitLab features, CI/CD pipelines, or need help with code, I'm here to help. Please feel free to ask any questions you might have.\n\nYour feedback is important to me. If you have a moment, please let me know how I can improve or if there's anything specific you'd like assistance with.",
          "contentHtml": "<p data-sourcepos=\"1:1-1:304\" dir=\"auto\">Hello! I'm GitLab Duo Chat, an AI assistant created by GitLab to help with DevSecOps-related questions and tasks. How can I assist you today? Whether you have questions about GitLab features, CI/CD pipelines, or need help with code, I'm here to help. Please feel free to ask any questions you might have.</p>\n<p data-sourcepos=\"3:1-3:152\" dir=\"auto\">Your feedback is important to me. If you have a moment, please let me know how I can improve or if there's anything specific you'd like assistance with.</p>",
          "timestamp": "2024-09-24T13:22:39Z",
          "errors": [],
          "extras": {
            "sources": null,
            "additionalContext": null
          }
        },
        {
          "requestId": "6bde582e-3952-47f2-bcf7-1d3d112a5004",
          "role": "USER",
          "content": "Are you receiving additional context in this request?",
          "contentHtml": "<p data-sourcepos=\"1:1-1:53\" dir=\"auto\">Are you receiving additional context in this request?</p>",
          "timestamp": "2024-09-24T13:22:53Z",
          "errors": [],
          "extras": {
            "sources": null,
            "additionalContext": []
          }
        },
        {
          "requestId": "6bde582e-3952-47f2-bcf7-1d3d112a5004",
          "role": "ASSISTANT",
          "content": "No, I am not receiving any additional context in this request beyond the question you've asked. The information I have access to is limited to what's defined in my knowledge base and the tools I've been provided. I don't have access to any external information or context that isn't explicitly shared in the conversation.\n\nIf you have any specific information or context you'd like me to consider, please feel free to provide it, and I'll be happy to assist you based on that information.\n\nYour feedback is valuable. If you have any other questions or if there's anything else I can help you with, please don't hesitate to ask.",
          "contentHtml": "<p data-sourcepos=\"1:1-1:321\" dir=\"auto\">No, I am not receiving any additional context in this request beyond the question you've asked. The information I have access to is limited to what's defined in my knowledge base and the tools I've been provided. I don't have access to any external information or context that isn't explicitly shared in the conversation.</p>\n<p data-sourcepos=\"3:1-3:165\" dir=\"auto\">If you have any specific information or context you'd like me to consider, please feel free to provide it, and I'll be happy to assist you based on that information.</p>\n<p data-sourcepos=\"5:1-5:137\" dir=\"auto\">Your feedback is valuable. If you have any other questions or if there's anything else I can help you with, please don't hesitate to ask.</p>",
          "timestamp": "2024-09-24T13:23:02Z",
          "errors": [],
          "extras": {
            "sources": null,
            "additionalContext": null
          }
        }
      ]
    }
  }
}
