{
  "config": {
    "line-length": {
      "code_blocks": false,
      "tables": false
    },
    "no-duplicate-heading": {
      "siblings_only": true
    }
  },
  "outputFormatters": [
    [
      "markdownlint-cli2-formatter-codequality"
    ],
    [
      "markdownlint-cli2-formatter-pretty"
    ]
  ]
}