{
  "version": "15.0.7",
  "vulnerabilities": [
    {
      "id": ":SKIP:",
      "category": "sast",
      "name": "Inefficient regular expression complexity",
      "description": "The application was found constructing a regular expression with user-controllable\ninput. This may result in excessive resource consumption \nwhen applied to certain inputs, or when the user is allowed to control \nthe match target.\n\nTo mitigate the issue, avoid allowing users to specify regular expressions \nprocessed by the server. If you must support user-controllable input in a \nregular expression, use an allow-list to restrict the expressions users \nmay supply to limit catastrophic backtracking.\n\nSecure Code Example:\n```\n# Define an allow-list of safe, predefined patterns\nALLOWED_PATTERNS = {\n  'digits_only' => /^\\d+$/,\n  'letters_only' => /^[a-zA-Z]+$/,\n  'email_format' => /^[a-zA-Z0-9._%+-]+@[a-zA-Z0-9.-]+\\.[a-zA-Z]{2,}$/\n}\nuser_pattern_key = params[:pattern_key]\ntarget_data = params[:data]\n\nif ALLOWED_PATTERNS.key?(user_pattern_key)\n  # Fetch the safe pattern from the allow-list\n  safe_pattern = ALLOWED_PATTERNS[user_pattern_key]\n  \n  # Apply the regular expression safely\n  if target_data.match(safe_pattern)\n    # Do something\n  else\n    # Do something\n  end\nelse\n  # Handle case where the pattern is not allowed\nend\n```\n",
      "cve": "semgrep_id:brakeman.ruby_regex_rule-CheckRegexDOS:3:3",
      "severity": "Medium",
      "scanner": {
        "id": "semgrep",
        "name": "Semgrep"
      },
      "location": {
        "file": "hello.rb",
        "start_line": 3
      },
      "identifiers": [
        {
          "type": "semgrep_id",
          "name": "brakeman.ruby_regex_rule-CheckRegexDOS",
          "value": "brakeman.ruby_regex_rule-CheckRegexDOS"
        },
        {
          "type": "cwe",
          "name": "CWE-1333",
          "value": "1333",
          "url": "https://cwe.mitre.org/data/definitions/1333.html"
        },
        {
          "type": "owasp",
          "name": "A04:2021 - Insecure Design",
          "value": "A04:2021"
        },
        {
          "type": "owasp",
          "name": "A6:2017 - Security Misconfiguration",
          "value": "A6:2017"
        },
        {
          "type": "brakeman_warning_code",
          "name": "Brakeman Warning Code 76",
          "value": "76"
        }
      ]
    },
    {
      "id": ":SKIP:",
      "category": "sast",
      "name": "Inefficient regular expression complexity",
      "description": "The application was found constructing a regular expression with user-controllable\ninput. This may result in excessive resource consumption \nwhen applied to certain inputs, or when the user is allowed to control \nthe match target.\n\nTo mitigate the issue, avoid allowing users to specify regular expressions \nprocessed by the server. If you must support user-controllable input in a \nregular expression, use an allow-list to restrict the expressions users \nmay supply to limit catastrophic backtracking.\n\nSecure Code Example:\n```\n# Define an allow-list of safe, predefined patterns\nALLOWED_PATTERNS = {\n  'digits_only' => /^\\d+$/,\n  'letters_only' => /^[a-zA-Z]+$/,\n  'email_format' => /^[a-zA-Z0-9._%+-]+@[a-zA-Z0-9.-]+\\.[a-zA-Z]{2,}$/\n}\nuser_pattern_key = params[:pattern_key]\ntarget_data = params[:data]\n\nif ALLOWED_PATTERNS.key?(user_pattern_key)\n  # Fetch the safe pattern from the allow-list\n  safe_pattern = ALLOWED_PATTERNS[user_pattern_key]\n  \n  # Apply the regular expression safely\n  if target_data.match(safe_pattern)\n    # Do something\n  else\n    # Do something\n  end\nelse\n  # Handle case where the pattern is not allowed\nend\n```\n",
      "cve": "semgrep_id:brakeman.ruby_regex_rule-CheckRegexDOS:7:7",
      "severity": "Medium",
      "scanner": {
        "id": "semgrep",
        "name": "Semgrep"
      },
      "location": {
        "file": "hello.rb",
        "start_line": 7
      },
      "identifiers": [
        {
          "type": "semgrep_id",
          "name": "brakeman.ruby_regex_rule-CheckRegexDOS",
          "value": "brakeman.ruby_regex_rule-CheckRegexDOS"
        },
        {
          "type": "cwe",
          "name": "CWE-1333",
          "value": "1333",
          "url": "https://cwe.mitre.org/data/definitions/1333.html"
        },
        {
          "type": "owasp",
          "name": "A04:2021 - Insecure Design",
          "value": "A04:2021"
        },
        {
          "type": "owasp",
          "name": "A6:2017 - Security Misconfiguration",
          "value": "A6:2017"
        },
        {
          "type": "brakeman_warning_code",
          "name": "Brakeman Warning Code 76",
          "value": "76"
        }
      ]
    }
  ],
  "dependency_files": [],
  "scan": {
    "analyzer": {
      "id": "semgrep",
      "name": "Semgrep",
      "url": "https://gitlab.com/gitlab-org/security-products/analyzers/semgrep",
      "vendor": {
        "name": "GitLab"
      },
      "version": ":SKIP:"
    },
    "scanner": {
      "id": "semgrep",
      "name": "Semgrep",
      "url": "https://github.com/returntocorp/semgrep",
      "vendor": {
        "name": "GitLab"
      },
      "version": ":SKIP:"
    },
    "type": "sast",
    "start_time": ":SKIP:",
    "end_time": ":SKIP:",
    "status": "success"
  }
}
