{
  "version": "15.1.0",
  "vulnerabilities": [
    {
      "id": "38b56d4674f598566885c2721b132887d3a44eeceb2aa121a3814dd2c7653cc3",
      "category": "secret_detection",
      "name": "AWS Access Token",
      "description": "AWS Access Token secret has been found in commit d2a8baa9.",
      "cve": "new_file.txt:54994e14a23af4e299528a7f21658f6a2f4a62ff91b0ce01ce64ac27d120c382:AWS",
      "severity": "Critical",
      "confidence": "Unknown",
      "raw_source_code_extract": "AKIAIMNOJVGFDXXXEBBB",
      "scanner": {
        "id": "gitleaks",
        "name": "Gitleaks"
      },
      "location": {
        "file": "new_file.txt",
        "commit": {
          "author": "Morgan Delagrange",
          "date": "2024-02-26T21:25:12Z",
          "message": "Add secret to new file",
          "sha": "d2a8baa9448cae3b4dc6776a06a0f11c2a622bf0"
        },
        "start_line": 3
      },
      "identifiers": [
        {
          "type": "gitleaks_rule_id",
          "name": "Gitleaks rule ID AWS",
          "value": "AWS"
        }
      ]
    }
  ],
  "scan": {
    "analyzer": {
      "id": "secrets",
      "name": "secrets",
      "url": "https://gitlab.com/gitlab-org/security-products/analyzers/secrets",
      "vendor": {
        "name": "GitLab"
      },
      "version": "6.0.0"
    },
    "scanner": {
      "id": "gitleaks",
      "name": "Gitleaks",
      "url": "https://github.com/gitleaks/gitleaks",
      "vendor": {
        "name": "GitLab"
      },
      "version": "8.18.2"
    },
    "type": "secret_detection",
    "start_time": ":SKIP:",
    "end_time": ":SKIP:",
    "status": "success"
  }
}
