{
  "version": "15.0.4",
  "vulnerabilities": [
    {
      "id": "ac6342295f1b73af662b03769b6086f024dcf972bb6cb29beb134b4b0fba1ff7",
      "name": "OS Command Injection",
      "description": "Attackers could trick execa into executing arbitrary binaries. This behaviour is caused by the setting `preferLocal=true` which makes execa search for locally installed binaries and executes them.",
      "severity": "Critical",
      "solution": "Upgrade to version 2.0.0 or above.",
      "location": {
        "file": "npm-shrinkwrap.json",
        "dependency": {
          "package": {
            "name": "execa"
          },
          "version": "0.7.0"
        }
      },
      "identifiers": [
        {
          "type": "gemnasium",
          "name": "Gemnasium-05cfa2e8-2d0c-42c1-8894-638e2f12ff3d",
          "value": "05cfa2e8-2d0c-42c1-8894-638e2f12ff3d",
          "url": "https://gitlab.com/gitlab-org/security-products/gemnasium-db/-/blob/v1.2.142/npm/execa/GMS-2020-2.yml"
        }
      ],
      "links": [
        {
          "url": "https://github.com/sindresorhus/execa/releases/tag/v2.0.0"
        }
      ],
      "details": {
        "vulnerable_package": {
          "name": "Vulnerable Package",
          "type": "text",
          "value": "execa:0.7.0"
        }
      }
    },
    {
      "id": "634cbd4dc2ba3441af444f2a5b8af0cd6ac3bad8b26f083e2aa897df8927f39b",
      "name": "Improper Input Validation",
      "description": "lodash is vulnerable to Prototype Pollution. The function `defaultsDeep` could be tricked into adding or modifying properties of `Object.prototype` using a constructor payload.",
      "severity": "Critical",
      "solution": "Upgrade to version 4.17.12 or above.",
      "location": {
        "file": "npm-shrinkwrap.json",
        "dependency": {
          "package": {
            "name": "lodash"
          },
          "version": "4.17.10"
        }
      },
      "identifiers": [
        {
          "type": "gemnasium",
          "name": "Gemnasium-4774cd67-936f-419e-8533-ae5cfe7db9f9",
          "value": "4774cd67-936f-419e-8533-ae5cfe7db9f9",
          "url": "https://gitlab.com/gitlab-org/security-products/gemnasium-db/-/blob/v1.2.142/npm/lodash/CVE-2019-10744.yml"
        },
        {
          "type": "cve",
          "name": "CVE-2019-10744",
          "value": "CVE-2019-10744",
          "url": "https://cve.mitre.org/cgi-bin/cvename.cgi?name=CVE-2019-10744"
        }
      ],
      "links": [
        {
          "url": "https://nvd.nist.gov/vuln/detail/CVE-2019-10744"
        }
      ],
      "details": {
        "vulnerable_package": {
          "name": "Vulnerable Package",
          "type": "text",
          "value": "lodash:4.17.10"
        }
      }
    },
    {
      "id": "5d2950f86a4ac9bdf3abdc65acaae1c068600d51c41160616365456d87e904e2",
      "name": "Uncontrolled Resource Consumption",
      "description": "A prototype pollution vulnerability was found in lodash where the functions `merge`, `mergeWith`, and `defaultsDeep` can be tricked into adding or modifying properties of `Object.prototype`.",
      "severity": "Critical",
      "solution": "Upgrade to version 4.17.11 or above.",
      "location": {
        "file": "npm-shrinkwrap.json",
        "dependency": {
          "package": {
            "name": "lodash"
          },
          "version": "4.17.10"
        }
      },
      "identifiers": [
        {
          "type": "gemnasium",
          "name": "Gemnasium-d8822263-8a6f-43ea-bb6b-7a2a0cabdf5c",
          "value": "d8822263-8a6f-43ea-bb6b-7a2a0cabdf5c",
          "url": "https://gitlab.com/gitlab-org/security-products/gemnasium-db/-/blob/v1.2.142/npm/lodash/CVE-2018-16487.yml"
        },
        {
          "type": "cve",
          "name": "CVE-2018-16487",
          "value": "CVE-2018-16487",
          "url": "https://cve.mitre.org/cgi-bin/cvename.cgi?name=CVE-2018-16487"
        }
      ],
      "links": [
        {
          "url": "https://hackerone.com/reports/380873"
        },
        {
          "url": "https://nvd.nist.gov/vuln/detail/CVE-2018-16487"
        }
      ],
      "details": {
        "vulnerable_package": {
          "name": "Vulnerable Package",
          "type": "text",
          "value": "lodash:4.17.10"
        }
      }
    },
    {
      "id": "0a3798eedfdb4f8f0353c816b5a3423a179862f58162b143641d9caa589c3b2c",
      "name": "Argument Injection or Modification",
      "description": "mixin-deep is vulnerable to Prototype Pollution. The function mixin-deep could be tricked into adding or modifying properties of `Object.prototype` using a constructor payload.",
      "severity": "Critical",
      "solution": "Upgrade to versions 1.3.2, 2.0.1 or above.",
      "location": {
        "file": "npm-shrinkwrap.json",
        "dependency": {
          "package": {
            "name": "mixin-deep"
          },
          "version": "1.3.1"
        }
      },
      "identifiers": [
        {
          "type": "gemnasium",
          "name": "Gemnasium-04af00f2-3b09-4656-9f4b-bcb2f4ef3db1",
          "value": "04af00f2-3b09-4656-9f4b-bcb2f4ef3db1",
          "url": "https://gitlab.com/gitlab-org/security-products/gemnasium-db/-/blob/v1.2.142/npm/mixin-deep/CVE-2019-10746.yml"
        },
        {
          "type": "cve",
          "name": "CVE-2019-10746",
          "value": "CVE-2019-10746",
          "url": "https://cve.mitre.org/cgi-bin/cvename.cgi?name=CVE-2019-10746"
        }
      ],
      "links": [
        {
          "url": "https://nvd.nist.gov/vuln/detail/CVE-2019-10746"
        }
      ],
      "details": {
        "vulnerable_package": {
          "name": "Vulnerable Package",
          "type": "text",
          "value": "mixin-deep:1.3.1"
        }
      }
    },
    {
      "id": "223a8355ea777aa80fa3e3165b705105fe67b7b4c84cfdfeff04283f09b21df4",
      "name": "Uncontrolled Resource Consumption",
      "description": "set-value is vulnerable to Prototype Pollution. The function `mixin-deep` could be tricked into adding or modifying properties of `Object.prototype` using any of the constructor, prototype and `_proto_` payloads.",
      "severity": "Critical",
      "solution": "Upgrade to versions 2.0.1, 3.0.1 or above.",
      "location": {
        "file": "npm-shrinkwrap.json",
        "dependency": {
          "package": {
            "name": "set-value"
          },
          "version": "0.4.3"
        }
      },
      "identifiers": [
        {
          "type": "gemnasium",
          "name": "Gemnasium-6f541fe7-9711-457a-8003-a52d8650b66f",
          "value": "6f541fe7-9711-457a-8003-a52d8650b66f",
          "url": "https://gitlab.com/gitlab-org/security-products/gemnasium-db/-/blob/v1.2.142/npm/set-value/CVE-2019-10747.yml"
        },
        {
          "type": "cve",
          "name": "CVE-2019-10747",
          "value": "CVE-2019-10747",
          "url": "https://cve.mitre.org/cgi-bin/cvename.cgi?name=CVE-2019-10747"
        }
      ],
      "links": [
        {
          "url": "https://nvd.nist.gov/vuln/detail/CVE-2019-10747"
        }
      ],
      "details": {
        "vulnerable_package": {
          "name": "Vulnerable Package",
          "type": "text",
          "value": "set-value:0.4.3"
        }
      }
    },
    {
      "id": "fcf5364a86dcbfa34396ed8132a362b0a2dc436cfdb8b66dbca667dddbbb587e",
      "name": "Uncontrolled Resource Consumption",
      "description": "set-value is vulnerable to Prototype Pollution. The function `mixin-deep` could be tricked into adding or modifying properties of `Object.prototype` using any of the constructor, prototype and `_proto_` payloads.",
      "severity": "Critical",
      "solution": "Upgrade to versions 2.0.1, 3.0.1 or above.",
      "location": {
        "file": "npm-shrinkwrap.json",
        "dependency": {
          "package": {
            "name": "set-value"
          },
          "version": "2.0.0"
        }
      },
      "identifiers": [
        {
          "type": "gemnasium",
          "name": "Gemnasium-6f541fe7-9711-457a-8003-a52d8650b66f",
          "value": "6f541fe7-9711-457a-8003-a52d8650b66f",
          "url": "https://gitlab.com/gitlab-org/security-products/gemnasium-db/-/blob/v1.2.142/npm/set-value/CVE-2019-10747.yml"
        },
        {
          "type": "cve",
          "name": "CVE-2019-10747",
          "value": "CVE-2019-10747",
          "url": "https://cve.mitre.org/cgi-bin/cvename.cgi?name=CVE-2019-10747"
        }
      ],
      "links": [
        {
          "url": "https://nvd.nist.gov/vuln/detail/CVE-2019-10747"
        }
      ],
      "details": {
        "vulnerable_package": {
          "name": "Vulnerable Package",
          "type": "text",
          "value": "set-value:2.0.0"
        }
      }
    },
    {
      "id": "683bd860a18cf1412738d848e2619408df361ff8bf6cc8805655e68041fb4cd2",
      "name": "Regular Expression Denial of Service",
      "description": "A regex in the form of `/[x-\\ud800]/u` causes the parser to enter an infinite loop. The string is not valid UTF16 which usually results in it being sanitized before reaching the parser.",
      "severity": "High",
      "solution": "Upgrade to versions 5.7.4, 6.4.1, 7.1.1 or later.",
      "location": {
        "file": "npm-shrinkwrap.json",
        "dependency": {
          "package": {
            "name": "acorn"
          },
          "version": "5.7.3"
        }
      },
      "identifiers": [
        {
          "type": "gemnasium",
          "name": "Gemnasium-cd6cfe67-4650-49c6-a10a-ee4195a573fa",
          "value": "cd6cfe67-4650-49c6-a10a-ee4195a573fa",
          "url": "https://gitlab.com/gitlab-org/security-products/gemnasium-db/-/blob/v1.2.142/npm/acorn/GMS-2020-1.yml"
        }
      ],
      "links": [
        {
          "url": "https://github.com/acornjs/acorn/commit/793c0e569ed1158672e3a40aeed1d8518832b802"
        },
        {
          "url": "https://snyk.io/vuln/SNYK-JS-ACORN-559469"
        },
        {
          "url": "https://www.npmjs.com/advisories/1488"
        }
      ],
      "details": {
        "vulnerable_package": {
          "name": "Vulnerable Package",
          "type": "text",
          "value": "acorn:5.7.3"
        }
      }
    },
    {
      "id": "6ce13f6d91cab79b9679dbc24966b277d2a1b9507208601aa50a3e8a8b2e8dd4",
      "name": "Regular Expression Denial of Service",
      "description": "A regex in the form of `/[x-\\ud800]/u` causes the parser to enter an infinite loop. The string is not valid UTF16 which usually results in it being sanitized before reaching the parser.",
      "severity": "High",
      "solution": "Upgrade to versions 5.7.4, 6.4.1, 7.1.1 or later.",
      "location": {
        "file": "npm-shrinkwrap.json",
        "dependency": {
          "package": {
            "name": "acorn"
          },
          "version": "6.4.0"
        }
      },
      "identifiers": [
        {
          "type": "gemnasium",
          "name": "Gemnasium-cd6cfe67-4650-49c6-a10a-ee4195a573fa",
          "value": "cd6cfe67-4650-49c6-a10a-ee4195a573fa",
          "url": "https://gitlab.com/gitlab-org/security-products/gemnasium-db/-/blob/v1.2.142/npm/acorn/GMS-2020-1.yml"
        }
      ],
      "links": [
        {
          "url": "https://github.com/acornjs/acorn/commit/793c0e569ed1158672e3a40aeed1d8518832b802"
        },
        {
          "url": "https://snyk.io/vuln/SNYK-JS-ACORN-559469"
        },
        {
          "url": "https://www.npmjs.com/advisories/1488"
        }
      ],
      "details": {
        "vulnerable_package": {
          "name": "Vulnerable Package",
          "type": "text",
          "value": "acorn:6.4.0"
        }
      }
    },
    {
      "id": "163781ad958937532eb390a3ed21e9171927703556bda66e8451eef9cd30e79c",
      "name": "Improper Input Validation",
      "description": "Decamelize uses regular expressions to evaluate a string and takes unescaped separator values, which can be used to create a denial of service attack.",
      "severity": "High",
      "solution": "Upgrade to version 1.1.2 or above.",
      "location": {
        "file": "npm-shrinkwrap.json",
        "dependency": {
          "package": {
            "name": "decamelize"
          },
          "version": "1.1.1"
        }
      },
      "identifiers": [
        {
          "type": "gemnasium",
          "name": "Gemnasium-cfa05151-753f-4373-833c-a27e772c87a2",
          "value": "cfa05151-753f-4373-833c-a27e772c87a2",
          "url": "https://gitlab.com/gitlab-org/security-products/gemnasium-db/-/blob/v1.2.142/npm/decamelize/CVE-2017-16023.yml"
        },
        {
          "type": "cve",
          "name": "CVE-2017-16023",
          "value": "CVE-2017-16023",
          "url": "https://cve.mitre.org/cgi-bin/cvename.cgi?name=CVE-2017-16023"
        }
      ],
      "links": [
        {
          "url": "https://nvd.nist.gov/vuln/detail/CVE-2017-16023"
        }
      ],
      "details": {
        "vulnerable_package": {
          "type": "text",
          "name": "Vulnerable Package",
          "value": "decamelize:1.1.1"
        }
      }
    },
    {
      "id": "369a70139046896b120b3bf8faad6a12aca2339e7da63733b644dcbe5a374bb9",
      "name": "Type checking vulnerability",
      "description": "`ctorName` allows external user input to overwrite certain internal attributes via a conflicting name.",
      "severity": "High",
      "solution": "Upgrade to version 6.0.3 or above.",
      "location": {
        "file": "npm-shrinkwrap.json",
        "dependency": {
          "package": {
            "name": "kind-of"
          },
          "version": "3.2.2"
        }
      },
      "identifiers": [
        {
          "type": "gemnasium",
          "name": "Gemnasium-c69c3883-e67c-4be5-a4dd-ce1d82173049",
          "value": "c69c3883-e67c-4be5-a4dd-ce1d82173049",
          "url": "https://gitlab.com/gitlab-org/security-products/gemnasium-db/-/blob/v1.2.142/npm/kind-of/CVE-2019-20149.yml"
        },
        {
          "type": "cve",
          "name": "CVE-2019-20149",
          "value": "CVE-2019-20149",
          "url": "https://cve.mitre.org/cgi-bin/cvename.cgi?name=CVE-2019-20149"
        }
      ],
      "links": [
        {
          "url": "https://github.com/jonschlinkert/kind-of/issues/30"
        },
        {
          "url": "https://github.com/jonschlinkert/kind-of/pull/31"
        },
        {
          "url": "https://nvd.nist.gov/vuln/detail/CVE-2019-20149"
        }
      ],
      "details": {
        "vulnerable_package": {
          "name": "Vulnerable Package",
          "type": "text",
          "value": "kind-of:3.2.2"
        }
      }
    },
    {
      "id": "390bacaa41c1f561a0f180d63b0c4f8a4dc7c434a5f6b045257b9835833b89d7",
      "name": "Type checking vulnerability",
      "description": "`ctorName` allows external user input to overwrite certain internal attributes via a conflicting name.",
      "severity": "High",
      "solution": "Upgrade to version 6.0.3 or above.",
      "location": {
        "file": "npm-shrinkwrap.json",
        "dependency": {
          "package": {
            "name": "kind-of"
          },
          "version": "4.0.0"
        }
      },
      "identifiers": [
        {
          "type": "gemnasium",
          "name": "Gemnasium-c69c3883-e67c-4be5-a4dd-ce1d82173049",
          "value": "c69c3883-e67c-4be5-a4dd-ce1d82173049",
          "url": "https://gitlab.com/gitlab-org/security-products/gemnasium-db/-/blob/v1.2.142/npm/kind-of/CVE-2019-20149.yml"
        },
        {
          "type": "cve",
          "name": "CVE-2019-20149",
          "value": "CVE-2019-20149",
          "url": "https://cve.mitre.org/cgi-bin/cvename.cgi?name=CVE-2019-20149"
        }
      ],
      "links": [
        {
          "url": "https://github.com/jonschlinkert/kind-of/issues/30"
        },
        {
          "url": "https://github.com/jonschlinkert/kind-of/pull/31"
        },
        {
          "url": "https://nvd.nist.gov/vuln/detail/CVE-2019-20149"
        }
      ],
      "details": {
        "vulnerable_package": {
          "name": "Vulnerable Package",
          "type": "text",
          "value": "kind-of:4.0.0"
        }
      }
    },
    {
      "id": "547a069b6ef01593cb3399bb0dd07a2d25bb69f85bc5a806e65e6c9809c0773c",
      "name": "Type checking vulnerability",
      "description": "`ctorName` allows external user input to overwrite certain internal attributes via a conflicting name.",
      "severity": "High",
      "solution": "Upgrade to version 6.0.3 or above.",
      "location": {
        "file": "npm-shrinkwrap.json",
        "dependency": {
          "package": {
            "name": "kind-of"
          },
          "version": "5.1.0"
        }
      },
      "identifiers": [
        {
          "type": "gemnasium",
          "name": "Gemnasium-c69c3883-e67c-4be5-a4dd-ce1d82173049",
          "value": "c69c3883-e67c-4be5-a4dd-ce1d82173049",
          "url": "https://gitlab.com/gitlab-org/security-products/gemnasium-db/-/blob/v1.2.142/npm/kind-of/CVE-2019-20149.yml"
        },
        {
          "type": "cve",
          "name": "CVE-2019-20149",
          "value": "CVE-2019-20149",
          "url": "https://cve.mitre.org/cgi-bin/cvename.cgi?name=CVE-2019-20149"
        }
      ],
      "links": [
        {
          "url": "https://github.com/jonschlinkert/kind-of/issues/30"
        },
        {
          "url": "https://github.com/jonschlinkert/kind-of/pull/31"
        },
        {
          "url": "https://nvd.nist.gov/vuln/detail/CVE-2019-20149"
        }
      ],
      "details": {
        "vulnerable_package": {
          "name": "Vulnerable Package",
          "type": "text",
          "value": "kind-of:5.1.0"
        }
      }
    },
    {
      "id": "e77051b1f9b3ea77ba9779cd14d261f4738ccf2402059199db3f958beab01ba8",
      "name": "Type checking vulnerability",
      "description": "`ctorName` allows external user input to overwrite certain internal attributes via a conflicting name.",
      "severity": "High",
      "solution": "Upgrade to version 6.0.3 or above.",
      "location": {
        "file": "npm-shrinkwrap.json",
        "dependency": {
          "package": {
            "name": "kind-of"
          },
          "version": "6.0.2"
        }
      },
      "identifiers": [
        {
          "type": "gemnasium",
          "name": "Gemnasium-c69c3883-e67c-4be5-a4dd-ce1d82173049",
          "value": "c69c3883-e67c-4be5-a4dd-ce1d82173049",
          "url": "https://gitlab.com/gitlab-org/security-products/gemnasium-db/-/blob/v1.2.142/npm/kind-of/CVE-2019-20149.yml"
        },
        {
          "type": "cve",
          "name": "CVE-2019-20149",
          "value": "CVE-2019-20149",
          "url": "https://cve.mitre.org/cgi-bin/cvename.cgi?name=CVE-2019-20149"
        }
      ],
      "links": [
        {
          "url": "https://github.com/jonschlinkert/kind-of/issues/30"
        },
        {
          "url": "https://github.com/jonschlinkert/kind-of/pull/31"
        },
        {
          "url": "https://nvd.nist.gov/vuln/detail/CVE-2019-20149"
        }
      ],
      "details": {
        "vulnerable_package": {
          "name": "Vulnerable Package",
          "type": "text",
          "value": "kind-of:6.0.2"
        }
      }
    },
    {
      "id": "7ccce9d131d443b066fa6acad7c5b80cfd90c6aede020601d12f2578a666a60a",
      "name": "Object Prototype Pollution",
      "description": "Prototype pollution attack when using `_.zipObjectDeep` in lodash.",
      "severity": "High",
      "solution": "Upgrade to version 4.17.20 or above.",
      "location": {
        "file": "npm-shrinkwrap.json",
        "dependency": {
          "package": {
            "name": "lodash"
          },
          "version": "4.17.10"
        }
      },
      "identifiers": [
        {
          "type": "gemnasium",
          "name": "Gemnasium-1f7fa42b-6b17-46b7-88a5-8995b43d298f",
          "value": "1f7fa42b-6b17-46b7-88a5-8995b43d298f",
          "url": "https://gitlab.com/gitlab-org/security-products/gemnasium-db/-/blob/v1.2.142/npm/lodash/CVE-2020-8203.yml"
        },
        {
          "type": "cve",
          "name": "CVE-2020-8203",
          "value": "CVE-2020-8203",
          "url": "https://cve.mitre.org/cgi-bin/cvename.cgi?name=CVE-2020-8203"
        }
      ],
      "links": [
        {
          "url": "https://github.com/lodash/lodash/issues/4874"
        },
        {
          "url": "https://nvd.nist.gov/vuln/detail/CVE-2020-8203"
        }
      ],
      "details": {
        "vulnerable_package": {
          "name": "Vulnerable Package",
          "type": "text",
          "value": "lodash:4.17.10"
        }
      }
    },
    {
      "id": "e5d0f9cd26e7eee72b1ad35b043467e9264236c29dd70db326dbcf0e96c14f74",
      "name": "Object Prototype Pollution",
      "description": "Prototype pollution attack when using `_.zipObjectDeep` in lodash.",
      "severity": "High",
      "solution": "Upgrade to version 4.17.20 or above.",
      "location": {
        "file": "npm-shrinkwrap.json",
        "dependency": {
          "package": {
            "name": "lodash"
          },
          "version": "4.17.15"
        }
      },
      "identifiers": [
        {
          "type": "gemnasium",
          "name": "Gemnasium-1f7fa42b-6b17-46b7-88a5-8995b43d298f",
          "value": "1f7fa42b-6b17-46b7-88a5-8995b43d298f",
          "url": "https://gitlab.com/gitlab-org/security-products/gemnasium-db/-/blob/v1.2.142/npm/lodash/CVE-2020-8203.yml"
        },
        {
          "type": "cve",
          "name": "CVE-2020-8203",
          "value": "CVE-2020-8203",
          "url": "https://cve.mitre.org/cgi-bin/cvename.cgi?name=CVE-2020-8203"
        }
      ],
      "links": [
        {
          "url": "https://github.com/lodash/lodash/issues/4874"
        },
        {
          "url": "https://nvd.nist.gov/vuln/detail/CVE-2020-8203"
        }
      ],
      "details": {
        "vulnerable_package": {
          "name": "Vulnerable Package",
          "type": "text",
          "value": "lodash:4.17.15"
        }
      }
    },
    {
      "id": "9c39b5651b0f37580b08db298f5365c0ad5c0772352b4bab42ac6bb355b85746",
      "name": "Uncontrolled Resource Consumption",
      "description": "lodash is affected by Uncontrolled Resource Consumption which can lead to a denial of service.",
      "severity": "Medium",
      "solution": "Upgrade to version 4.17.11 or above.",
      "location": {
        "file": "npm-shrinkwrap.json",
        "dependency": {
          "package": {
            "name": "lodash"
          },
          "version": "4.17.10"
        }
      },
      "identifiers": [
        {
          "type": "gemnasium",
          "name": "Gemnasium-109f3b4c-bdb3-48be-b2f9-e0348fba64bd",
          "value": "109f3b4c-bdb3-48be-b2f9-e0348fba64bd",
          "url": "https://gitlab.com/gitlab-org/security-products/gemnasium-db/-/blob/v1.2.142/npm/lodash/CVE-2019-1010266.yml"
        },
        {
          "type": "cve",
          "name": "CVE-2019-1010266",
          "value": "CVE-2019-1010266",
          "url": "https://cve.mitre.org/cgi-bin/cvename.cgi?name=CVE-2019-1010266"
        }
      ],
      "links": [
        {
          "url": "https://github.com/lodash/lodash/issues/3359"
        },
        {
          "url": "https://nvd.nist.gov/vuln/detail/CVE-2019-1010266"
        }
      ],
      "details": {
        "vulnerable_package": {
          "name": "Vulnerable Package",
          "type": "text",
          "value": "lodash:4.17.10"
        }
      }
    },
    {
      "id": "36e483b067e0d84ed4f8fcd5a56b9b96cb36aaff30101f7a054525c08cd1f3de",
      "name": "Improper Input Validation",
      "description": "minimist could be tricked into adding or modifying properties of `Object.prototype` using a `constructor` or `__proto__` payload.",
      "severity": "Medium",
      "solution": "Upgrade to version 1.2.2 or above.",
      "location": {
        "file": "npm-shrinkwrap.json",
        "dependency": {
          "package": {
            "name": "minimist"
          },
          "version": "0.0.8"
        }
      },
      "identifiers": [
        {
          "type": "gemnasium",
          "name": "Gemnasium-53e8766c-27eb-4278-8c4f-3dcef53a68bf",
          "value": "53e8766c-27eb-4278-8c4f-3dcef53a68bf",
          "url": "https://gitlab.com/gitlab-org/security-products/gemnasium-db/-/blob/v1.2.142/npm/minimist/CVE-2020-7598.yml"
        },
        {
          "type": "cve",
          "name": "CVE-2020-7598",
          "value": "CVE-2020-7598",
          "url": "https://cve.mitre.org/cgi-bin/cvename.cgi?name=CVE-2020-7598"
        }
      ],
      "links": [
        {
          "url": "https://nvd.nist.gov/vuln/detail/CVE-2020-7598"
        }
      ],
      "details": {
        "vulnerable_package": {
          "name": "Vulnerable Package",
          "type": "text",
          "value": "minimist:0.0.8"
        }
      }
    },
    {
      "id": "6da5d10d1cbd545690f00a79184516a40589745394e0adf3b67cc7f17a83a7b1",
      "name": "Improper Input Validation",
      "description": "yargs-parser could be tricked into adding or modifying properties of `Object.prototype` using a `__proto__` payload.",
      "severity": "Medium",
      "solution": "Upgrade to versions 13.1.2, 15.0.1, 18.1.1 or above.",
      "location": {
        "file": "npm-shrinkwrap.json",
        "dependency": {
          "package": {
            "name": "yargs-parser"
          },
          "version": "8.1.0"
        }
      },
      "identifiers": [
        {
          "type": "gemnasium",
          "name": "Gemnasium-a9e73366-2694-40b0-bcc1-795368307084",
          "value": "a9e73366-2694-40b0-bcc1-795368307084",
          "url": "https://gitlab.com/gitlab-org/security-products/gemnasium-db/-/blob/v1.2.142/npm/yargs-parser/CVE-2020-7608.yml"
        },
        {
          "type": "cve",
          "name": "CVE-2020-7608",
          "value": "CVE-2020-7608",
          "url": "https://cve.mitre.org/cgi-bin/cvename.cgi?name=CVE-2020-7608"
        }
      ],
      "links": [
        {
          "url": "https://nvd.nist.gov/vuln/detail/CVE-2020-7608"
        }
      ],
      "details": {
        "vulnerable_package": {
          "name": "Vulnerable Package",
          "type": "text",
          "value": "yargs-parser:8.1.0"
        }
      }
    },
    {
      "id": "db5ed9c22f49a744c3b54ac657295cfb3fdd334399ab51e9a1002e17f3d32a13",
      "name": "Improper Input Validation",
      "description": "yargs-parser could be tricked into adding or modifying properties of `Object.prototype` using a `__proto__` payload.",
      "severity": "Medium",
      "solution": "Upgrade to versions 13.1.2, 15.0.1, 18.1.1 or above.",
      "location": {
        "file": "npm-shrinkwrap.json",
        "dependency": {
          "package": {
            "name": "yargs-parser"
          },
          "version": "9.0.2"
        }
      },
      "identifiers": [
        {
          "type": "gemnasium",
          "name": "Gemnasium-a9e73366-2694-40b0-bcc1-795368307084",
          "value": "a9e73366-2694-40b0-bcc1-795368307084",
          "url": "https://gitlab.com/gitlab-org/security-products/gemnasium-db/-/blob/v1.2.142/npm/yargs-parser/CVE-2020-7608.yml"
        },
        {
          "type": "cve",
          "name": "CVE-2020-7608",
          "value": "CVE-2020-7608",
          "url": "https://cve.mitre.org/cgi-bin/cvename.cgi?name=CVE-2020-7608"
        }
      ],
      "links": [
        {
          "url": "https://nvd.nist.gov/vuln/detail/CVE-2020-7608"
        }
      ],
      "details": {
        "vulnerable_package": {
          "name": "Vulnerable Package",
          "type": "text",
          "value": "yargs-parser:9.0.2"
        }
      }
    },
    {
      "id": "3458c53dcfdfe2c6705a47ff975c24570c1529a5ccc7e04eb1af3495478b4033",
      "name": "Regular Expression Denial of Service",
      "description": "Decamelize uses regular expressions to evaluate a string and takes unescaped separator values, which can be used to create a denial of service attack.",
      "severity": "Unknown",
      "solution": "Upgrade to version 1.1.2 or later.",
      "location": {
        "file": "npm-shrinkwrap.json",
        "dependency": {
          "package": {
            "name": "decamelize"
          },
          "version": "1.1.1"
        }
      },
      "identifiers": [
        {
          "type": "gemnasium",
          "name": "Gemnasium-980f208d-a755-46f3-8bac-4decf4c48f56",
          "value": "980f208d-a755-46f3-8bac-4decf4c48f56",
          "url": "https://gitlab.com/gitlab-org/security-products/gemnasium-db/-/blob/v1.2.142/npm/decamelize/GMS-2015-53.yml"
        }
      ],
      "links": [
        {
          "url": "https://github.com/sindresorhus/decamelize/issues/5"
        },
        {
          "url": "https://nodesecurity.io/advisories/308"
        }
      ],
      "details": {
        "vulnerable_package": {
          "type": "text",
          "name": "Vulnerable Package",
          "value": "decamelize:1.1.1"
        }
      }
    }
  ],
  "scan": {
    "analyzer": {
      "id": "gemnasium",
      "name": "Gemnasium",
      "url": "https://gitlab.com/gitlab-org/security-products/analyzers/gemnasium",
      "vendor": {
        "name": "GitLab"
      },
      "version": "3.10.7"
    },
    "scanner": {
      "id": "gemnasium",
      "name": "Gemnasium",
      "url": "https://gitlab.com/gitlab-org/security-products/analyzers/gemnasium",
      "vendor": {
        "name": "GitLab"
      },
      "version": "2.33.0"
    },
    "type": "dependency_scanning",
    "start_time": "2022-02-16T04:37:46",
    "end_time": "2022-02-16T04:37:48",
    "status": "success"
  }
}
