[
  {
  "name": "@adobe/css-tools",
  "version": "4.3.0-beta.2"
  },
  {
    "name": "acorn-walk",
    "version": "6.2.0"
  },
  {
    "name": "asynckit",
    "version": "0.4.0"
  },
  {
    "name": "psl",
    "version": "1.9.0"
  },
  {
    "name": "html-encoding-sniffer",
    "version": "1.0.2"
  },
  {
    "name": "jsbn",
    "version": "0.1.1"
  },
  {
    "name": "punycode",
    "version": "2.3.0"
  },
  {
    "name": "stealthy-require",
    "version": "1.1.1"
  },
  {
    "name": "tr46",
    "version": "1.0.1"
  },
  {
    "name": "bcrypt-pbkdf",
    "version": "1.0.2"
  },
  {
    "name": "data-urls",
    "version": "1.1.0"
  },
  {
    "name": "ecc-jsbn",
    "version": "0.1.2"
  },
  {
    "name": "tweetnacl",
    "version": "0.14.5"
  },
  {
    "name": "w3c-hr-time",
    "version": "1.0.2"
  },
  {
    "name": "whatwg-url",
    "version": "7.1.0"
  },
  {
    "name": "sshpk",
    "version": "1.17.0"
  },
  {
    "name": "verror",
    "version": "1.10.0"
  },
  {
    "name": "aws4",
    "version": "1.12.0"
  },
  {
    "name": "forever-agent",
    "version": "0.6.1"
  },
  {
    "name": "lodash.sortby",
    "version": "4.7.0"
  },
  {
    "name": "dashdash",
    "version": "1.14.1"
  },
  {
    "name": "esprima",
    "version": "4.0.1"
  },
  {
    "name": "form-data",
    "version": "2.3.3"
  },
  {
    "name": "har-validator",
    "version": "5.1.5"
  },
  {
    "name": "optionator",
    "version": "0.8.3"
  },
  {
    "name": "abab",
    "version": "2.0.6"
  },
  {
    "name": "aws-sign2",
    "version": "0.7.0"
  },
  {
    "name": "cssom",
    "version": "0.3.8"
  },
  {
    "name": "mime-types",
    "version": "2.1.35"
  },
  {
    "name": "webidl-conversions",
    "version": "4.0.2"
  },
  {
    "name": "whatwg-encoding",
    "version": "1.0.5"
  },
  {
    "name": "async-limiter",
    "version": "1.0.1"
  },
  {
    "name": "http-signature",
    "version": "1.2.0"
  },
  {
    "name": "json-schema-traverse",
    "version": "0.4.1"
  },
  {
    "name": "nyc",
    "version": "11.9.0"
  },
  {
    "name": "ws",
    "version": "5.2.3"
  },
  {
    "name": "sax",
    "version": "1.2.4"
  },
  {
    "name": "source-map",
    "version": "0.6.1"
  },
  {
    "name": "acorn",
    "version": "6.4.2"
  },
  {
    "name": "combined-stream",
    "version": "1.0.8"
  },
  {
    "name": "safe-buffer",
    "version": "5.2.1"
  },
  {
    "name": "isstream",
    "version": "0.1.2"
  },
  {
    "name": "parse5",
    "version": "4.0.0"
  },
  {
    "name": "symbol-tree",
    "version": "3.2.4"
  },
  {
    "name": "estraverse",
    "version": "4.3.0"
  },
  {
    "name": "fast-deep-equal",
    "version": "3.1.3"
  },
  {
    "name": "fast-json-stable-stringify",
    "version": "2.1.0"
  },
  {
    "name": "normalize.css",
    "version": "7.0.0"
  },
  {
    "name": "nwsapi",
    "version": "2.2.2"
  },
  {
    "name": "pn",
    "version": "1.1.0"
  },
  {
    "name": "uri-js",
    "version": "4.4.1"
  },
  {
    "name": "core-util-is",
    "version": "1.0.2"
  },
  {
    "name": "fast-levenshtein",
    "version": "2.0.6"
  },
  {
    "name": "har-schema",
    "version": "2.0.0"
  },
  {
    "name": "moment",
    "version": "2.29.4"
  },
  {
    "name": "performance-now",
    "version": "2.1.0"
  },
  {
    "name": "whatwg-url",
    "version": "6.5.0"
  },
  {
    "name": "array-equal",
    "version": "1.0.0"
  },
  {
    "name": "deep-is",
    "version": "0.1.4"
  },
  {
    "name": "mime-db",
    "version": "1.52.0"
  },
  {
    "name": "prelude-ls",
    "version": "1.1.2"
  },
  {
    "name": "tough-cookie",
    "version": "2.5.0"
  },
  {
    "name": "uuid",
    "version": "3.4.0"
  },
  {
    "name": "extend",
    "version": "3.0.2"
  },
  {
    "name": "is-typedarray",
    "version": "1.0.0"
  },
  {
    "name": "levn",
    "version": "0.3.0"
  },
  {
    "name": "oauth-sign",
    "version": "0.9.0"
  },
  {
    "name": "whatwg-mimetype",
    "version": "2.3.0"
  },
  {
    "name": "assert-plus",
    "version": "1.0.0"
  },
  {
    "name": "highlight.js",
    "version": "9.18.5"
  },
  {
    "name": "iconv-lite",
    "version": "0.4.24"
  },
  {
    "name": "extsprintf",
    "version": "1.3.0"
  },
  {
    "name": "json-schema",
    "version": "0.4.0"
  },
  {
    "name": "json-stringify-safe",
    "version": "5.0.1"
  },
  {
    "name": "acorn-globals",
    "version": "4.3.4"
  },
  {
    "name": "caseless",
    "version": "0.12.0"
  },
  {
    "name": "domexception",
    "version": "1.0.1"
  },
  {
    "name": "lodash",
    "version": "4.17.21"
  },
  {
    "name": "tunnel-agent",
    "version": "0.6.0"
  },
  {
    "name": "esutils",
    "version": "2.0.3"
  },
  {
    "name": "jsdom",
    "version": "11.12.0"
  },
  {
    "name": "left-pad",
    "version": "1.3.0"
  },
  {
    "name": "ajv",
    "version": "6.12.6"
  },
  {
    "name": "cssstyle",
    "version": "1.4.0"
  },
  {
    "name": "delayed-stream",
    "version": "1.0.0"
  },
  {
    "name": "decamelize",
    "version": "1.1.1"
  },
  {
    "name": "escodegen",
    "version": "1.14.3"
  },
  {
    "name": "getpass",
    "version": "0.1.7"
  },
  {
    "name": "jsprim",
    "version": "1.4.2"
  },
  {
    "name": "qs",
    "version": "6.5.3"
  },
  {
    "name": "acorn",
    "version": "5.7.4"
  },
  {
    "name": "asn1",
    "version": "0.2.6"
  },
  {
    "name": "browser-process-hrtime",
    "version": "1.0.0"
  },
  {
    "name": "type-check",
    "version": "0.3.2"
  },
  {
    "name": "word-wrap",
    "version": "1.2.3"
  },
  {
    "name": "xml-name-validator",
    "version": "3.0.0"
  },
  {
    "name": "request",
    "version": "2.88.2"
  },
  {
    "name": "request-promise-native",
    "version": "1.0.9"
   },
   {
    "name": "request-promise-core",
    "version": "1.1.4"
   },
  {
    "name": "safer-buffer",
    "version": "2.1.2"
  }
]
