[
  {
    "version": "2.2.0",
    "name": "jerryscript"
  },
  {
    "version": "1.8.1",
    "name": "poco"
  },
  {
    "version": "1.1.1g",
    "name": "openssl"
  },
  {
    "version": "1.2.11",
    "name": "zlib"
  },
  {
    "version": "3.4.0",
    "name": "libarchive"
  },
  {
    "version": "1.15",
    "name": "libiconv"
  }
]
