[
    {
        "dependencies": [
            {
                "required_version": ">=0.9.2", 
                "installed_version": "1.0", 
                "package_name": "MarkupSafe", 
                "key": "markupsafe"
            }
        ], 
        "package": {
            "installed_version": "1.0.7", 
            "package_name": "Mako", 
            "key": "mako"
        }
    }, 
    {
        "dependencies": [
            {
                "required_version": ">=6.0.0", 
                "installed_version": "9.0.1", 
                "package_name": "pip", 
                "key": "pip"
            }
        ], 
        "package": {
            "installed_version": "0.10.1", 
            "package_name": "pipdeptree", 
            "key": "pipdeptree"
        }
    }, 
    {
        "dependencies": [], 
        "package": {
            "installed_version": "1.0", 
            "package_name": "MarkupSafe", 
            "key": "markupsafe"
        }
    }, 
    {
        "dependencies": [
            {
                "required_version": ">=0.9.2", 
                "installed_version": "1.0", 
                "package_name": "MarkupSafe", 
                "key": "markupsafe"
            }
        ], 
        "package": {
            "installed_version": "1.3", 
            "package_name": "WebHelpers", 
            "key": "webhelpers"
        }
    }, 
    {
        "dependencies": [], 
        "package": {
            "installed_version": "1.7.4", 
            "package_name": "WebOb", 
            "key": "webob"
        }
    }, 
    {
        "dependencies": [], 
        "package": {
            "installed_version": "1.0.2", 
            "package_name": "funcsigs", 
            "key": "funcsigs"
        }
    }, 
    {
        "dependencies": [
            {
                "required_version": null, 
                "installed_version": "1.5.2", 
                "package_name": "PasteDeploy", 
                "key": "pastedeploy"
            }, 
            {
                "required_version": null, 
                "installed_version": "1.11.0", 
                "package_name": "six", 
                "key": "six"
            }, 
            {
                "required_version": ">=1.3", 
                "installed_version": "2.0.3", 
                "package_name": "Paste", 
                "key": "paste"
            }
        ], 
        "package": {
            "installed_version": "2.0.2", 
            "package_name": "PasteScript", 
            "key": "pastescript"
        }
    }, 
    {
        "dependencies": [
            {
                "required_version": null, 
                "installed_version": "1.0.2", 
                "package_name": "funcsigs", 
                "key": "funcsigs"
            }
        ], 
        "package": {
            "installed_version": "1.9.0", 
            "package_name": "Beaker", 
            "key": "beaker"
        }
    }, 
    {
        "dependencies": [], 
        "package": {
            "installed_version": "1.1.0", 
            "package_name": "waitress", 
            "key": "waitress"
        }
    }, 
    {
        "dependencies": [
            {
                "required_version": ">=1.2.4", 
                "installed_version": "1.3.1", 
                "package_name": "FormEncode", 
                "key": "formencode"
            }, 
            {
                "required_version": ">=1.5.4", 
                "installed_version": "1.9.0", 
                "package_name": "Beaker", 
                "key": "beaker"
            }, 
            {
                "required_version": ">=0.5.0", 
                "installed_version": "1.0.7", 
                "package_name": "Mako", 
                "key": "mako"
            }, 
            {
                "required_version": ">=3.3.2", 
                "installed_version": "4.1.2", 
                "package_name": "decorator", 
                "key": "decorator"
            }, 
            {
                "required_version": ">=1.5.0", 
                "installed_version": "1.5.2", 
                "package_name": "PasteDeploy", 
                "key": "pastedeploy"
            }, 
            {
                "required_version": ">=1.7.5.1", 
                "installed_version": "2.0.3", 
                "package_name": "Paste", 
                "key": "paste"
            }, 
            {
                "required_version": ">=0.5.1", 
                "installed_version": "0.5.2", 
                "package_name": "Tempita", 
                "key": "tempita"
            }, 
            {
                "required_version": ">=1.12.3", 
                "installed_version": "2.4.1", 
                "package_name": "Routes", 
                "key": "routes"
            }, 
            {
                "required_version": ">=1.3.1", 
                "installed_version": "2.0.29", 
                "package_name": "WebTest", 
                "key": "webtest"
            }, 
            {
                "required_version": ">=0.10.3", 
                "installed_version": "0.13.1", 
                "package_name": "WebError", 
                "key": "weberror"
            }, 
            {
                "required_version": ">=0.6.4", 
                "installed_version": "1.3", 
                "package_name": "WebHelpers", 
                "key": "webhelpers"
            }, 
            {
                "required_version": ">=2.2.1", 
                "installed_version": "3.13.2", 
                "package_name": "simplejson", 
                "key": "simplejson"
            }, 
            {
                "required_version": ">=1.7.4.2", 
                "installed_version": "2.0.2", 
                "package_name": "PasteScript", 
                "key": "pastescript"
            }, 
            {
                "required_version": ">=1.1.1", 
                "installed_version": "1.7.4", 
                "package_name": "WebOb", 
                "key": "webob"
            }, 
            {
                "required_version": ">=0.15", 
                "installed_version": "1.0", 
                "package_name": "MarkupSafe", 
                "key": "markupsafe"
            }, 
            {
                "required_version": ">=1.1.2", 
                "installed_version": "1.3.7", 
                "package_name": "nose", 
                "key": "nose"
            }
        ], 
        "package": {
            "installed_version": "1.0.2", 
            "package_name": "Pylons", 
            "key": "pylons"
        }
    }, 
    {
        "dependencies": [], 
        "package": {
            "installed_version": "0.5.2", 
            "package_name": "Tempita", 
            "key": "tempita"
        }
    }, 
    {
        "dependencies": [], 
        "package": {
            "installed_version": "1.3.1", 
            "package_name": "FormEncode", 
            "key": "formencode"
        }
    }, 
    {
        "dependencies": [], 
        "package": {
            "installed_version": "4.1.2", 
            "package_name": "decorator", 
            "key": "decorator"
        }
    }, 
    {
        "dependencies": [
            {
                "required_version": null, 
                "installed_version": "1.11.0", 
                "package_name": "six", 
                "key": "six"
            }, 
            {
                "required_version": ">=1.2", 
                "installed_version": "1.7.4", 
                "package_name": "WebOb", 
                "key": "webob"
            }, 
            {
                "required_version": null, 
                "installed_version": "4.6.0", 
                "package_name": "beautifulsoup4", 
                "key": "beautifulsoup4"
            }, 
            {
                "required_version": ">=0.8.5", 
                "installed_version": "1.1.0", 
                "package_name": "waitress", 
                "key": "waitress"
            }
        ], 
        "package": {
            "installed_version": "2.0.29", 
            "package_name": "WebTest", 
            "key": "webtest"
        }
    }, 
    {
        "dependencies": [], 
        "package": {
            "installed_version": "38.2.4", 
            "package_name": "setuptools", 
            "key": "setuptools"
        }
    }, 
    {
        "dependencies": [], 
        "package": {
            "installed_version": "15.1.0", 
            "package_name": "virtualenv", 
            "key": "virtualenv"
        }
    }, 
    {
        "dependencies": [], 
        "package": {
            "installed_version": "1.3.7", 
            "package_name": "nose", 
            "key": "nose"
        }
    }, 
    {
        "dependencies": [], 
        "package": {
            "installed_version": "9.0.1", 
            "package_name": "pip", 
            "key": "pip"
        }
    }, 
    {
        "dependencies": [
            {
                "required_version": null, 
                "installed_version": "2.2.0", 
                "package_name": "Pygments", 
                "key": "pygments"
            }, 
            {
                "required_version": null, 
                "installed_version": "1.7.4", 
                "package_name": "WebOb", 
                "key": "webob"
            }, 
            {
                "required_version": ">=1.7.1", 
                "installed_version": "2.0.3", 
                "package_name": "Paste", 
                "key": "paste"
            }, 
            {
                "required_version": null, 
                "installed_version": "0.5.2", 
                "package_name": "Tempita", 
                "key": "tempita"
            }
        ], 
        "package": {
            "installed_version": "0.13.1", 
            "package_name": "WebError", 
            "key": "weberror"
        }
    }, 
    {
        "dependencies": [], 
        "package": {
            "installed_version": "2.2.0", 
            "package_name": "Pygments", 
            "key": "pygments"
        }
    }, 
    {
        "dependencies": [
            {
                "required_version": null, 
                "installed_version": "1.11.0", 
                "package_name": "six", 
                "key": "six"
            }, 
            {
                "required_version": ">=0.3", 
                "installed_version": "0.7", 
                "package_name": "repoze.lru", 
                "key": "repoze.lru"
            }
        ], 
        "package": {
            "installed_version": "2.4.1", 
            "package_name": "Routes", 
            "key": "routes"
        }
    }, 
    {
        "dependencies": [], 
        "package": {
            "installed_version": "1.5.2", 
            "package_name": "PasteDeploy", 
            "key": "pastedeploy"
        }
    }, 
    {
        "dependencies": [], 
        "package": {
            "installed_version": "0.7", 
            "package_name": "repoze.lru", 
            "key": "repoze.lru"
        }
    }, 
    {
        "dependencies": [
            {
                "required_version": ">=1.4.0", 
                "installed_version": "1.11.0", 
                "package_name": "six", 
                "key": "six"
            }
        ], 
        "package": {
            "installed_version": "2.0.3", 
            "package_name": "Paste", 
            "key": "paste"
        }
    }, 
    {
        "dependencies": [], 
        "package": {
            "installed_version": "1.11.0", 
            "package_name": "six", 
            "key": "six"
        }
    }, 
    {
        "dependencies": [], 
        "package": {
            "installed_version": "4.6.0", 
            "package_name": "beautifulsoup4", 
            "key": "beautifulsoup4"
        }
    }, 
    {
        "dependencies": [], 
        "package": {
            "installed_version": "3.13.2", 
            "package_name": "simplejson", 
            "key": "simplejson"
        }
    }, 
    {
        "dependencies": [], 
        "package": {
            "installed_version": "0.30.0", 
            "package_name": "wheel", 
            "key": "wheel"
        }
    }
]
