{
  "version": "15.0.4",
  "vulnerabilities": [
    {
      "id": "a2b5212b3b57f849a9af1a23dc704b60145591a01e4fe66b597d97d6c754ae51",
      "name": "fake vuln to demonstrate scan time advisory db updates",
      "description": "fake vuln to demonstrate scan time advisory db updates",
      "severity": "Medium",
      "solution": "Upgrade to version after fake one.",
      "location": {
        "file": "go.mod",
        "dependency": {
          "package": {
            "name": "github.com/sirupsen/logrus"
          },
          "version": "v1.4.2"
        }
      },
      "identifiers": [
        {
          "type": "gemnasium",
          "name": "Gemnasium-f8d39948-1678-453e-87f5-854c53bc2d5b",
          "value": "f8d39948-1678-453e-87f5-854c53bc2d5b",
          "url": "https://gitlab.com/gitlab-org/security-products/gemnasium-db/-/blob/2020-03-13/go/github.com/sirupsen/logrus/fake-vuln.yml"
        }
      ],
      "links": [
        {
          "url": "https://nvd.nist.gov/vuln/detail/fake-vuln"
        }
      ],
      "details": {
        "vulnerable_package": {
          "type": "text",
          "name": "Vulnerable Package",
          "value": "github.com/sirupsen/logrus:v1.4.2"
        }
      }
    }
  ],
  "scan": {
    "analyzer": {
      "id": "gemnasium",
      "name": "Gemnasium",
      "url": "https://gitlab.com/gitlab-org/security-products/analyzers/gemnasium",
      "vendor": {
        "name": "GitLab"
      },
      "version": "4.7.0"
    },
    "scanner": {
      "id": "gemnasium",
      "name": "Gemnasium",
      "url": "https://gitlab.com/gitlab-org/security-products/analyzers/gemnasium",
      "vendor": {
        "name": "GitLab"
      },
      "version": "4.7.0"
    },
    "type": "dependency_scanning",
    "start_time": "2023-10-24T23:01:54",
    "end_time": "2023-10-24T23:01:56",
    "status": "success"
  }
}
