{
  "bomFormat": "CycloneDX",
  "specVersion": "1.4",
  "serialNumber": "urn:uuid:1428f75f-5c40-408a-b092-2a9b9a396774",
  "version": 1,
  "metadata": {
    "timestamp": "2024-04-02T18:27:10Z",
    "tools": [
      {
        "vendor": "GitLab",
        "name": "Gemnasium",
        "version": "4.16.0"
      }
    ],
    "authors": [
      {
        "name": "GitLab",
        "email": "support@gitlab.com"
      }
    ],
    "properties": [
      {
        "name": "gitlab:dependency_scanning:input_file:path",
        "value": "proj2/build.sbt"
      },
      {
        "name": "gitlab:dependency_scanning:package_manager:name",
        "value": "sbt"
      },
      {
        "name": "gitlab:meta:schema_version",
        "value": "1"
      }
    ]
  },
  "components": [
    {
      "name": "com.fasterxml.jackson.core/jackson-annotations",
      "version": "2.9.0",
      "purl": "pkg:maven/com.fasterxml.jackson.core/jackson-annotations@2.9.0",
      "type": "library",
      "bom-ref": "pkg:maven/com.fasterxml.jackson.core/jackson-annotations@2.9.0"
    },
    {
      "name": "com.fasterxml.jackson.core/jackson-core",
      "version": "2.9.4",
      "purl": "pkg:maven/com.fasterxml.jackson.core/jackson-core@2.9.4",
      "type": "library",
      "bom-ref": "pkg:maven/com.fasterxml.jackson.core/jackson-core@2.9.4"
    },
    {
      "name": "com.fasterxml.jackson.core/jackson-databind",
      "version": "2.9.4",
      "purl": "pkg:maven/com.fasterxml.jackson.core/jackson-databind@2.9.4",
      "type": "library",
      "bom-ref": "pkg:maven/com.fasterxml.jackson.core/jackson-databind@2.9.4"
    }
  ],
  "dependencies": [
    {
      "ref": "pkg:maven/com.fasterxml.jackson.core/jackson-databind@2.9.4",
      "dependsOn": [
        "pkg:maven/com.fasterxml.jackson.core/jackson-annotations@2.9.0",
        "pkg:maven/com.fasterxml.jackson.core/jackson-core@2.9.4"
      ]
    }
  ]
}
