[
  {
    "name": "io.netty/netty-all",
    "version": "4.1.0.Final"
  },
  {
    "name": "org.apache.logging.log4j/log4j-core",
    "version": "2.8.2"
  },
  {
    "name": "org.apache.logging.log4j/log4j-api",
    "version": "2.8.2"
  },
  {
    "name": "junit/junit",
    "version": "3.8.1"
  }
]
