{
  "version": "15.0.4",
  "vulnerabilities": [
    {
      "id": "87797f11e024ad58a98702bf8142902deab3321b4d24935ba6ffbf3f2e361fad",
      "name": "OS Command Injection",
      "description": "Attackers could trick execa into executing arbitrary binaries. This behaviour is caused by the setting `preferLocal=true` which makes execa search for locally installed binaries and executes them.",
      "severity": "Critical",
      "solution": "Upgrade to version 2.0.0 or above.",
      "location": {
        "file": "package-lock.json",
        "dependency": {
          "package": {
            "name": "execa"
          },
          "version": "0.7.0"
        }
      },
      "identifiers": [
        {
          "type": "gemnasium",
          "name": "Gemnasium-05cfa2e8-2d0c-42c1-8894-638e2f12ff3d",
          "value": "05cfa2e8-2d0c-42c1-8894-638e2f12ff3d",
          "url": "https://gitlab.com/gitlab-org/security-products/gemnasium-db/-/blob/v1.2.142/npm/execa/GMS-2020-2.yml"
        }
      ],
      "links": [
        {
          "url": "https://github.com/sindresorhus/execa/releases/tag/v2.0.0"
        }
      ],
      "details": {
        "vulnerable_package": {
          "name": "Vulnerable Package",
          "type": "text",
          "value": "execa:0.7.0"
        }
      }
    },
    {
      "id": "ba91b82238983163ee95178b8cb92db76136799c41ff1e6dc1bd4845abe5d8ec",
      "name": "Improper Input Validation",
      "description": "lodash is vulnerable to Prototype Pollution. The function `defaultsDeep` could be tricked into adding or modifying properties of `Object.prototype` using a constructor payload.",
      "severity": "Critical",
      "solution": "Upgrade to version 4.17.12 or above.",
      "location": {
        "file": "package-lock.json",
        "dependency": {
          "package": {
            "name": "lodash"
          },
          "version": "4.17.10"
        }
      },
      "identifiers": [
        {
          "type": "gemnasium",
          "name": "Gemnasium-4774cd67-936f-419e-8533-ae5cfe7db9f9",
          "value": "4774cd67-936f-419e-8533-ae5cfe7db9f9",
          "url": "https://gitlab.com/gitlab-org/security-products/gemnasium-db/-/blob/v1.2.142/npm/lodash/CVE-2019-10744.yml"
        },
        {
          "type": "cve",
          "name": "CVE-2019-10744",
          "value": "CVE-2019-10744",
          "url": "https://cve.mitre.org/cgi-bin/cvename.cgi?name=CVE-2019-10744"
        }
      ],
      "links": [
        {
          "url": "https://nvd.nist.gov/vuln/detail/CVE-2019-10744"
        }
      ],
      "details": {
        "vulnerable_package": {
          "name": "Vulnerable Package",
          "type": "text",
          "value": "lodash:4.17.10"
        }
      }
    },
    {
      "id": "e8fc82193348e9a13150e3337c5438335fee25370f1555653497b68f7a023bd8",
      "name": "Uncontrolled Resource Consumption",
      "description": "A prototype pollution vulnerability was found in lodash where the functions `merge`, `mergeWith`, and `defaultsDeep` can be tricked into adding or modifying properties of `Object.prototype`.",
      "severity": "Critical",
      "solution": "Upgrade to version 4.17.11 or above.",
      "location": {
        "file": "package-lock.json",
        "dependency": {
          "package": {
            "name": "lodash"
          },
          "version": "4.17.10"
        }
      },
      "identifiers": [
        {
          "type": "gemnasium",
          "name": "Gemnasium-d8822263-8a6f-43ea-bb6b-7a2a0cabdf5c",
          "value": "d8822263-8a6f-43ea-bb6b-7a2a0cabdf5c",
          "url": "https://gitlab.com/gitlab-org/security-products/gemnasium-db/-/blob/v1.2.142/npm/lodash/CVE-2018-16487.yml"
        },
        {
          "type": "cve",
          "name": "CVE-2018-16487",
          "value": "CVE-2018-16487",
          "url": "https://cve.mitre.org/cgi-bin/cvename.cgi?name=CVE-2018-16487"
        }
      ],
      "links": [
        {
          "url": "https://hackerone.com/reports/380873"
        },
        {
          "url": "https://nvd.nist.gov/vuln/detail/CVE-2018-16487"
        }
      ],
      "details": {
        "vulnerable_package": {
          "name": "Vulnerable Package",
          "type": "text",
          "value": "lodash:4.17.10"
        }
      }
    },
    {
      "id": "c28763eadc8001f3d97729a28f8eaf4358193eea5a77d7cef7088af8ff4d635b",
      "name": "Argument Injection or Modification",
      "description": "mixin-deep is vulnerable to Prototype Pollution. The function mixin-deep could be tricked into adding or modifying properties of `Object.prototype` using a constructor payload.",
      "severity": "Critical",
      "solution": "Upgrade to versions 1.3.2, 2.0.1 or above.",
      "location": {
        "file": "package-lock.json",
        "dependency": {
          "package": {
            "name": "mixin-deep"
          },
          "version": "1.3.1"
        }
      },
      "identifiers": [
        {
          "type": "gemnasium",
          "name": "Gemnasium-04af00f2-3b09-4656-9f4b-bcb2f4ef3db1",
          "value": "04af00f2-3b09-4656-9f4b-bcb2f4ef3db1",
          "url": "https://gitlab.com/gitlab-org/security-products/gemnasium-db/-/blob/v1.2.142/npm/mixin-deep/CVE-2019-10746.yml"
        },
        {
          "type": "cve",
          "name": "CVE-2019-10746",
          "value": "CVE-2019-10746",
          "url": "https://cve.mitre.org/cgi-bin/cvename.cgi?name=CVE-2019-10746"
        }
      ],
      "links": [
        {
          "url": "https://nvd.nist.gov/vuln/detail/CVE-2019-10746"
        }
      ],
      "details": {
        "vulnerable_package": {
          "name": "Vulnerable Package",
          "type": "text",
          "value": "mixin-deep:1.3.1"
        }
      }
    },
    {
      "id": "94d4c8707f589345370f0be04166d4fdd32d2a036299e8d35e8c013ff0764bae",
      "name": "Uncontrolled Resource Consumption",
      "description": "set-value is vulnerable to Prototype Pollution. The function `mixin-deep` could be tricked into adding or modifying properties of `Object.prototype` using any of the constructor, prototype and `_proto_` payloads.",
      "severity": "Critical",
      "solution": "Upgrade to versions 2.0.1, 3.0.1 or above.",
      "location": {
        "file": "package-lock.json",
        "dependency": {
          "package": {
            "name": "set-value"
          },
          "version": "0.4.3"
        }
      },
      "identifiers": [
        {
          "type": "gemnasium",
          "name": "Gemnasium-6f541fe7-9711-457a-8003-a52d8650b66f",
          "value": "6f541fe7-9711-457a-8003-a52d8650b66f",
          "url": "https://gitlab.com/gitlab-org/security-products/gemnasium-db/-/blob/v1.2.142/npm/set-value/CVE-2019-10747.yml"
        },
        {
          "type": "cve",
          "name": "CVE-2019-10747",
          "value": "CVE-2019-10747",
          "url": "https://cve.mitre.org/cgi-bin/cvename.cgi?name=CVE-2019-10747"
        }
      ],
      "links": [
        {
          "url": "https://nvd.nist.gov/vuln/detail/CVE-2019-10747"
        }
      ],
      "details": {
        "vulnerable_package": {
          "name": "Vulnerable Package",
          "type": "text",
          "value": "set-value:0.4.3"
        }
      }
    },
    {
      "id": "5a06f3a1b3b9f66710b61378571600cfa28f5a16a4380a76dee5a94588f92710",
      "name": "Uncontrolled Resource Consumption",
      "description": "set-value is vulnerable to Prototype Pollution. The function `mixin-deep` could be tricked into adding or modifying properties of `Object.prototype` using any of the constructor, prototype and `_proto_` payloads.",
      "severity": "Critical",
      "solution": "Upgrade to versions 2.0.1, 3.0.1 or above.",
      "location": {
        "file": "package-lock.json",
        "dependency": {
          "package": {
            "name": "set-value"
          },
          "version": "2.0.0"
        }
      },
      "identifiers": [
        {
          "type": "gemnasium",
          "name": "Gemnasium-6f541fe7-9711-457a-8003-a52d8650b66f",
          "value": "6f541fe7-9711-457a-8003-a52d8650b66f",
          "url": "https://gitlab.com/gitlab-org/security-products/gemnasium-db/-/blob/v1.2.142/npm/set-value/CVE-2019-10747.yml"
        },
        {
          "type": "cve",
          "name": "CVE-2019-10747",
          "value": "CVE-2019-10747",
          "url": "https://cve.mitre.org/cgi-bin/cvename.cgi?name=CVE-2019-10747"
        }
      ],
      "links": [
        {
          "url": "https://nvd.nist.gov/vuln/detail/CVE-2019-10747"
        }
      ],
      "details": {
        "vulnerable_package": {
          "name": "Vulnerable Package",
          "type": "text",
          "value": "set-value:2.0.0"
        }
      }
    },
    {
      "id": "1020173de051434f7a713abcb3fe861691e2c967051a77b223dc0e2b28d8dd65",
      "name": "Regular Expression Denial of Service",
      "description": "A regex in the form of `/[x-\\ud800]/u` causes the parser to enter an infinite loop. The string is not valid UTF16 which usually results in it being sanitized before reaching the parser.",
      "severity": "High",
      "solution": "Upgrade to versions 5.7.4, 6.4.1, 7.1.1 or later.",
      "location": {
        "file": "package-lock.json",
        "dependency": {
          "package": {
            "name": "acorn"
          },
          "version": "5.7.3"
        }
      },
      "identifiers": [
        {
          "type": "gemnasium",
          "name": "Gemnasium-cd6cfe67-4650-49c6-a10a-ee4195a573fa",
          "value": "cd6cfe67-4650-49c6-a10a-ee4195a573fa",
          "url": "https://gitlab.com/gitlab-org/security-products/gemnasium-db/-/blob/v1.2.142/npm/acorn/GMS-2020-1.yml"
        }
      ],
      "links": [
        {
          "url": "https://github.com/acornjs/acorn/commit/793c0e569ed1158672e3a40aeed1d8518832b802"
        },
        {
          "url": "https://snyk.io/vuln/SNYK-JS-ACORN-559469"
        },
        {
          "url": "https://www.npmjs.com/advisories/1488"
        }
      ],
      "details": {
        "vulnerable_package": {
          "name": "Vulnerable Package",
          "type": "text",
          "value": "acorn:5.7.3"
        }
      }
    },
    {
      "id": "df17562ea80fd4dd805329eb4f59a0343495168cb6dadc405584c816d3948eb0",
      "name": "Regular Expression Denial of Service",
      "description": "A regex in the form of `/[x-\\ud800]/u` causes the parser to enter an infinite loop. The string is not valid UTF16 which usually results in it being sanitized before reaching the parser.",
      "severity": "High",
      "solution": "Upgrade to versions 5.7.4, 6.4.1, 7.1.1 or later.",
      "location": {
        "file": "package-lock.json",
        "dependency": {
          "package": {
            "name": "acorn"
          },
          "version": "6.4.0"
        }
      },
      "identifiers": [
        {
          "type": "gemnasium",
          "name": "Gemnasium-cd6cfe67-4650-49c6-a10a-ee4195a573fa",
          "value": "cd6cfe67-4650-49c6-a10a-ee4195a573fa",
          "url": "https://gitlab.com/gitlab-org/security-products/gemnasium-db/-/blob/v1.2.142/npm/acorn/GMS-2020-1.yml"
        }
      ],
      "links": [
        {
          "url": "https://github.com/acornjs/acorn/commit/793c0e569ed1158672e3a40aeed1d8518832b802"
        },
        {
          "url": "https://snyk.io/vuln/SNYK-JS-ACORN-559469"
        },
        {
          "url": "https://www.npmjs.com/advisories/1488"
        }
      ],
      "details": {
        "vulnerable_package": {
          "name": "Vulnerable Package",
          "type": "text",
          "value": "acorn:6.4.0"
        }
      }
    },
    {
      "id": "663757bbab45e6097c9f00ce2fc35ac9bf527cf48dfbecfddc3d9017bfa2dff6",
      "name": "Improper Input Validation",
      "description": "Decamelize uses regular expressions to evaluate a string and takes unescaped separator values, which can be used to create a denial of service attack.",
      "severity": "High",
      "solution": "Upgrade to version 1.1.2 or above.",
      "location": {
        "file": "package-lock.json",
        "dependency": {
          "package": {
            "name": "decamelize"
          },
          "version": "1.1.1"
        }
      },
      "identifiers": [
        {
          "type": "gemnasium",
          "name": "Gemnasium-cfa05151-753f-4373-833c-a27e772c87a2",
          "value": "cfa05151-753f-4373-833c-a27e772c87a2",
          "url": "https://gitlab.com/gitlab-org/security-products/gemnasium-db/-/blob/v1.2.142/npm/decamelize/CVE-2017-16023.yml"
        },
        {
          "type": "cve",
          "name": "CVE-2017-16023",
          "value": "CVE-2017-16023",
          "url": "https://cve.mitre.org/cgi-bin/cvename.cgi?name=CVE-2017-16023"
        }
      ],
      "links": [
        {
          "url": "https://nvd.nist.gov/vuln/detail/CVE-2017-16023"
        }
      ],
      "details": {
        "vulnerable_package": {
          "type": "text",
          "name": "Vulnerable Package",
          "value": "decamelize:1.1.1"
        }
      }
    },
    {
      "id": "1b00a3fc73664e5f67164e91cbb50e30eb5019d2f87dd59292e8ce4b9034551e",
      "name": "Type checking vulnerability",
      "description": "`ctorName` allows external user input to overwrite certain internal attributes via a conflicting name.",
      "severity": "High",
      "solution": "Upgrade to version 6.0.3 or above.",
      "location": {
        "file": "package-lock.json",
        "dependency": {
          "package": {
            "name": "kind-of"
          },
          "version": "3.2.2"
        }
      },
      "identifiers": [
        {
          "type": "gemnasium",
          "name": "Gemnasium-c69c3883-e67c-4be5-a4dd-ce1d82173049",
          "value": "c69c3883-e67c-4be5-a4dd-ce1d82173049",
          "url": "https://gitlab.com/gitlab-org/security-products/gemnasium-db/-/blob/v1.2.142/npm/kind-of/CVE-2019-20149.yml"
        },
        {
          "type": "cve",
          "name": "CVE-2019-20149",
          "value": "CVE-2019-20149",
          "url": "https://cve.mitre.org/cgi-bin/cvename.cgi?name=CVE-2019-20149"
        }
      ],
      "links": [
        {
          "url": "https://github.com/jonschlinkert/kind-of/issues/30"
        },
        {
          "url": "https://github.com/jonschlinkert/kind-of/pull/31"
        },
        {
          "url": "https://nvd.nist.gov/vuln/detail/CVE-2019-20149"
        }
      ],
      "details": {
        "vulnerable_package": {
          "name": "Vulnerable Package",
          "type": "text",
          "value": "kind-of:3.2.2"
        }
      }
    },
    {
      "id": "e03ab6cee7a3d00878b6500b84b1468caf5cde231811f7f07e5cb0a54221f2ad",
      "name": "Type checking vulnerability",
      "description": "`ctorName` allows external user input to overwrite certain internal attributes via a conflicting name.",
      "severity": "High",
      "solution": "Upgrade to version 6.0.3 or above.",
      "location": {
        "file": "package-lock.json",
        "dependency": {
          "package": {
            "name": "kind-of"
          },
          "version": "4.0.0"
        }
      },
      "identifiers": [
        {
          "type": "gemnasium",
          "name": "Gemnasium-c69c3883-e67c-4be5-a4dd-ce1d82173049",
          "value": "c69c3883-e67c-4be5-a4dd-ce1d82173049",
          "url": "https://gitlab.com/gitlab-org/security-products/gemnasium-db/-/blob/v1.2.142/npm/kind-of/CVE-2019-20149.yml"
        },
        {
          "type": "cve",
          "name": "CVE-2019-20149",
          "value": "CVE-2019-20149",
          "url": "https://cve.mitre.org/cgi-bin/cvename.cgi?name=CVE-2019-20149"
        }
      ],
      "links": [
        {
          "url": "https://github.com/jonschlinkert/kind-of/issues/30"
        },
        {
          "url": "https://github.com/jonschlinkert/kind-of/pull/31"
        },
        {
          "url": "https://nvd.nist.gov/vuln/detail/CVE-2019-20149"
        }
      ],
      "details": {
        "vulnerable_package": {
          "name": "Vulnerable Package",
          "type": "text",
          "value": "kind-of:4.0.0"
        }
      }
    },
    {
      "id": "85cb7cd41a3ff009442511a18add2d21a507d952f7fc089bc905365fead77cf2",
      "name": "Type checking vulnerability",
      "description": "`ctorName` allows external user input to overwrite certain internal attributes via a conflicting name.",
      "severity": "High",
      "solution": "Upgrade to version 6.0.3 or above.",
      "location": {
        "file": "package-lock.json",
        "dependency": {
          "package": {
            "name": "kind-of"
          },
          "version": "5.1.0"
        }
      },
      "identifiers": [
        {
          "type": "gemnasium",
          "name": "Gemnasium-c69c3883-e67c-4be5-a4dd-ce1d82173049",
          "value": "c69c3883-e67c-4be5-a4dd-ce1d82173049",
          "url": "https://gitlab.com/gitlab-org/security-products/gemnasium-db/-/blob/v1.2.142/npm/kind-of/CVE-2019-20149.yml"
        },
        {
          "type": "cve",
          "name": "CVE-2019-20149",
          "value": "CVE-2019-20149",
          "url": "https://cve.mitre.org/cgi-bin/cvename.cgi?name=CVE-2019-20149"
        }
      ],
      "links": [
        {
          "url": "https://github.com/jonschlinkert/kind-of/issues/30"
        },
        {
          "url": "https://github.com/jonschlinkert/kind-of/pull/31"
        },
        {
          "url": "https://nvd.nist.gov/vuln/detail/CVE-2019-20149"
        }
      ],
      "details": {
        "vulnerable_package": {
          "name": "Vulnerable Package",
          "type": "text",
          "value": "kind-of:5.1.0"
        }
      }
    },
    {
      "id": "9d00a5ad9febe44a0566136387b91bb591109d9e728e0d229da063814e9cd37f",
      "name": "Type checking vulnerability",
      "description": "`ctorName` allows external user input to overwrite certain internal attributes via a conflicting name.",
      "severity": "High",
      "solution": "Upgrade to version 6.0.3 or above.",
      "location": {
        "file": "package-lock.json",
        "dependency": {
          "package": {
            "name": "kind-of"
          },
          "version": "6.0.2"
        }
      },
      "identifiers": [
        {
          "type": "gemnasium",
          "name": "Gemnasium-c69c3883-e67c-4be5-a4dd-ce1d82173049",
          "value": "c69c3883-e67c-4be5-a4dd-ce1d82173049",
          "url": "https://gitlab.com/gitlab-org/security-products/gemnasium-db/-/blob/v1.2.142/npm/kind-of/CVE-2019-20149.yml"
        },
        {
          "type": "cve",
          "name": "CVE-2019-20149",
          "value": "CVE-2019-20149",
          "url": "https://cve.mitre.org/cgi-bin/cvename.cgi?name=CVE-2019-20149"
        }
      ],
      "links": [
        {
          "url": "https://github.com/jonschlinkert/kind-of/issues/30"
        },
        {
          "url": "https://github.com/jonschlinkert/kind-of/pull/31"
        },
        {
          "url": "https://nvd.nist.gov/vuln/detail/CVE-2019-20149"
        }
      ],
      "details": {
        "vulnerable_package": {
          "name": "Vulnerable Package",
          "type": "text",
          "value": "kind-of:6.0.2"
        }
      }
    },
    {
      "id": "448f6b38a6cdf8a3833f9aa58aea1f068b87416bb382fab983f265f52cec43d4",
      "name": "Object Prototype Pollution",
      "description": "Prototype pollution attack when using `_.zipObjectDeep` in lodash.",
      "severity": "High",
      "solution": "Upgrade to version 4.17.20 or above.",
      "location": {
        "file": "package-lock.json",
        "dependency": {
          "package": {
            "name": "lodash"
          },
          "version": "4.17.10"
        }
      },
      "identifiers": [
        {
          "type": "gemnasium",
          "name": "Gemnasium-1f7fa42b-6b17-46b7-88a5-8995b43d298f",
          "value": "1f7fa42b-6b17-46b7-88a5-8995b43d298f",
          "url": "https://gitlab.com/gitlab-org/security-products/gemnasium-db/-/blob/v1.2.142/npm/lodash/CVE-2020-8203.yml"
        },
        {
          "type": "cve",
          "name": "CVE-2020-8203",
          "value": "CVE-2020-8203",
          "url": "https://cve.mitre.org/cgi-bin/cvename.cgi?name=CVE-2020-8203"
        }
      ],
      "links": [
        {
          "url": "https://github.com/lodash/lodash/issues/4874"
        },
        {
          "url": "https://nvd.nist.gov/vuln/detail/CVE-2020-8203"
        }
      ],
      "details": {
        "vulnerable_package": {
          "name": "Vulnerable Package",
          "type": "text",
          "value": "lodash:4.17.10"
        }
      }
    },
    {
      "id": "64bff59838aa888225bbd16bf988711522e1badebd15f12964fcd33b8a5d8e58",
      "name": "Object Prototype Pollution",
      "description": "Prototype pollution attack when using `_.zipObjectDeep` in lodash.",
      "severity": "High",
      "solution": "Upgrade to version 4.17.20 or above.",
      "location": {
        "file": "package-lock.json",
        "dependency": {
          "package": {
            "name": "lodash"
          },
          "version": "4.17.15"
        }
      },
      "identifiers": [
        {
          "type": "gemnasium",
          "name": "Gemnasium-1f7fa42b-6b17-46b7-88a5-8995b43d298f",
          "value": "1f7fa42b-6b17-46b7-88a5-8995b43d298f",
          "url": "https://gitlab.com/gitlab-org/security-products/gemnasium-db/-/blob/v1.2.142/npm/lodash/CVE-2020-8203.yml"
        },
        {
          "type": "cve",
          "name": "CVE-2020-8203",
          "value": "CVE-2020-8203",
          "url": "https://cve.mitre.org/cgi-bin/cvename.cgi?name=CVE-2020-8203"
        }
      ],
      "links": [
        {
          "url": "https://github.com/lodash/lodash/issues/4874"
        },
        {
          "url": "https://nvd.nist.gov/vuln/detail/CVE-2020-8203"
        }
      ],
      "details": {
        "vulnerable_package": {
          "name": "Vulnerable Package",
          "type": "text",
          "value": "lodash:4.17.15"
        }
      }
    },
    {
      "id": "ae55e1b3d3bc6ff745d4ee0733256169552936ffd2b078fe7d94bb0e678f9bd5",
      "name": "Cross-site Scripting",
      "description": "In jQuery, passing HTML containing `<option>` elements from untrusted sources, even after sanitizing it, to one of jQuery's DOM manipulation methods (i.e., `.html()`, `.append()`, and others) may execute untrusted code.",
      "severity": "Medium",
      "solution": "Upgrade to version 3.5.0 or above.",
      "location": {
        "file": "node_modules/JSONSelect/site/js/jquery-1.6.1.min.js",
        "dependency": {
          "package": {
            "name": "jquery"
          },
          "version": "1.6.1"
        }
      },
      "identifiers": [
        {
          "type": "gemnasium",
          "name": "Gemnasium-1d85b518-81f3-4e17-8375-08ad1531bce1",
          "value": "1d85b518-81f3-4e17-8375-08ad1531bce1",
          "url": "https://gitlab.com/gitlab-org/security-products/gemnasium-db/-/blob/v1.2.142/npm/jquery/CVE-2020-11023.yml"
        },
        {
          "type": "cve",
          "name": "CVE-2020-11023",
          "value": "CVE-2020-11023",
          "url": "https://cve.mitre.org/cgi-bin/cvename.cgi?name=CVE-2020-11023"
        }
      ],
      "links": [
        {
          "url": "https://blog.jquery.com/2020/04/10/jquery-3-5-0-released"
        },
        {
          "url": "https://jquery.com/upgrade-guide/3.5/"
        },
        {
          "url": "https://nvd.nist.gov/vuln/detail/CVE-2020-11023"
        }
      ],
      "details": {
        "vulnerable_package": {
          "name": "Vulnerable Package",
          "type": "text",
          "value": "jquery:1.6.1"
        }
      }
    },
    {
      "id": "11d2bfac743f6c6fa08dd2804dffd41be32f378a9417c7b6e7b15401144d43fe",
      "name": "Cross-site Scripting",
      "description": "JQuery allows Cross-site Scripting attacks via the `load` method. The `load` method fails to recognize and remove `<script>` HTML tags that contain a whitespace character such as `</script >`.",
      "severity": "Medium",
      "solution": "Upgrade to version 1.9.1 or above.",
      "location": {
        "file": "node_modules/JSONSelect/site/js/jquery-1.6.1.min.js",
        "dependency": {
          "package": {
            "name": "jquery"
          },
          "version": "1.6.1"
        }
      },
      "identifiers": [
        {
          "type": "gemnasium",
          "name": "Gemnasium-65460751-636c-4e9f-9dd3-00bfc7379043",
          "value": "65460751-636c-4e9f-9dd3-00bfc7379043",
          "url": "https://gitlab.com/gitlab-org/security-products/gemnasium-db/-/blob/v1.2.142/npm/jquery/CVE-2020-7656.yml"
        },
        {
          "type": "cve",
          "name": "CVE-2020-7656",
          "value": "CVE-2020-7656",
          "url": "https://cve.mitre.org/cgi-bin/cvename.cgi?name=CVE-2020-7656"
        }
      ],
      "links": [
        {
          "url": "https://nvd.nist.gov/vuln/detail/CVE-2020-7656"
        }
      ],
      "details": {
        "vulnerable_package": {
          "name": "Vulnerable Package",
          "type": "text",
          "value": "jquery:1.6.1"
        }
      }
    },
    {
      "id": "b414c12f1f2e9ed71338c9e121ade3ce0418abfc1b78c1a0d995341db05cf2a8",
      "name": "Cross-site Scripting",
      "description": "In jQuery, passing HTML from untrusted sources, even after sanitizing it, to one of jQuery's DOM manipulation methods (i.e., `.html()`, `.append()`, and others) may execute untrusted code.",
      "severity": "Medium",
      "solution": "Upgrade to version 3.5.0 or above.",
      "location": {
        "file": "node_modules/JSONSelect/site/js/jquery-1.6.1.min.js",
        "dependency": {
          "package": {
            "name": "jquery"
          },
          "version": "1.6.1"
        }
      },
      "identifiers": [
        {
          "type": "gemnasium",
          "name": "Gemnasium-fd4f9aca-c215-4d5d-a6b0-13f34d3df383",
          "value": "fd4f9aca-c215-4d5d-a6b0-13f34d3df383",
          "url": "https://gitlab.com/gitlab-org/security-products/gemnasium-db/-/blob/v1.2.142/npm/jquery/CVE-2020-11022.yml"
        },
        {
          "type": "cve",
          "name": "CVE-2020-11022",
          "value": "CVE-2020-11022",
          "url": "https://cve.mitre.org/cgi-bin/cvename.cgi?name=CVE-2020-11022"
        }
      ],
      "links": [
        {
          "url": "https://blog.jquery.com/2020/04/10/jquery-3-5-0-released/"
        },
        {
          "url": "https://jquery.com/upgrade-guide/3.5/"
        },
        {
          "url": "https://nvd.nist.gov/vuln/detail/CVE-2020-11022"
        }
      ],
      "details": {
        "vulnerable_package": {
          "name": "Vulnerable Package",
          "type": "text",
          "value": "jquery:1.6.1"
        }
      }
    },
    {
      "id": "cec3d91f0e82c6e9a2b34d89a65ac82b5a5fbdd70b14edb2b2c6345a5cb44041",
      "name": "Cross-site Scripting",
      "description": "In jQuery, passing HTML containing `<option>` elements from untrusted sources, even after sanitizing it, to one of jQuery's DOM manipulation methods (i.e., `.html()`, `.append()`, and others) may execute untrusted code.",
      "severity": "Medium",
      "solution": "Upgrade to version 3.5.0 or above.",
      "location": {
        "file": "node_modules/JSONSelect/src/test/js/jquery-1.6.1.min.js",
        "dependency": {
          "package": {
            "name": "jquery"
          },
          "version": "1.6.1"
        }
      },
      "identifiers": [
        {
          "type": "gemnasium",
          "name": "Gemnasium-1d85b518-81f3-4e17-8375-08ad1531bce1",
          "value": "1d85b518-81f3-4e17-8375-08ad1531bce1",
          "url": "https://gitlab.com/gitlab-org/security-products/gemnasium-db/-/blob/v1.2.142/npm/jquery/CVE-2020-11023.yml"
        },
        {
          "type": "cve",
          "name": "CVE-2020-11023",
          "value": "CVE-2020-11023",
          "url": "https://cve.mitre.org/cgi-bin/cvename.cgi?name=CVE-2020-11023"
        }
      ],
      "links": [
        {
          "url": "https://blog.jquery.com/2020/04/10/jquery-3-5-0-released"
        },
        {
          "url": "https://jquery.com/upgrade-guide/3.5/"
        },
        {
          "url": "https://nvd.nist.gov/vuln/detail/CVE-2020-11023"
        }
      ],
      "details": {
        "vulnerable_package": {
          "name": "Vulnerable Package",
          "type": "text",
          "value": "jquery:1.6.1"
        }
      }
    },
    {
      "id": "27db619fc43e5ffdb20ad11fd4e8e0637afc6f11f531ac2cc287b216de2e3120",
      "name": "Cross-site Scripting",
      "description": "JQuery allows Cross-site Scripting attacks via the `load` method. The `load` method fails to recognize and remove `<script>` HTML tags that contain a whitespace character such as `</script >`.",
      "severity": "Medium",
      "solution": "Upgrade to version 1.9.1 or above.",
      "location": {
        "file": "node_modules/JSONSelect/src/test/js/jquery-1.6.1.min.js",
        "dependency": {
          "package": {
            "name": "jquery"
          },
          "version": "1.6.1"
        }
      },
      "identifiers": [
        {
          "type": "gemnasium",
          "name": "Gemnasium-65460751-636c-4e9f-9dd3-00bfc7379043",
          "value": "65460751-636c-4e9f-9dd3-00bfc7379043",
          "url": "https://gitlab.com/gitlab-org/security-products/gemnasium-db/-/blob/v1.2.142/npm/jquery/CVE-2020-7656.yml"
        },
        {
          "type": "cve",
          "name": "CVE-2020-7656",
          "value": "CVE-2020-7656",
          "url": "https://cve.mitre.org/cgi-bin/cvename.cgi?name=CVE-2020-7656"
        }
      ],
      "links": [
        {
          "url": "https://nvd.nist.gov/vuln/detail/CVE-2020-7656"
        }
      ],
      "details": {
        "vulnerable_package": {
          "name": "Vulnerable Package",
          "type": "text",
          "value": "jquery:1.6.1"
        }
      }
    },
    {
      "id": "5bb3b0bd7dcfb240a89d97ccfec0c84e43690eadc0d25f468afb8d96137aacee",
      "name": "Cross-site Scripting",
      "description": "In jQuery, passing HTML from untrusted sources, even after sanitizing it, to one of jQuery's DOM manipulation methods (i.e., `.html()`, `.append()`, and others) may execute untrusted code.",
      "severity": "Medium",
      "solution": "Upgrade to version 3.5.0 or above.",
      "location": {
        "file": "node_modules/JSONSelect/src/test/js/jquery-1.6.1.min.js",
        "dependency": {
          "package": {
            "name": "jquery"
          },
          "version": "1.6.1"
        }
      },
      "identifiers": [
        {
          "type": "gemnasium",
          "name": "Gemnasium-fd4f9aca-c215-4d5d-a6b0-13f34d3df383",
          "value": "fd4f9aca-c215-4d5d-a6b0-13f34d3df383",
          "url": "https://gitlab.com/gitlab-org/security-products/gemnasium-db/-/blob/v1.2.142/npm/jquery/CVE-2020-11022.yml"
        },
        {
          "type": "cve",
          "name": "CVE-2020-11022",
          "value": "CVE-2020-11022",
          "url": "https://cve.mitre.org/cgi-bin/cvename.cgi?name=CVE-2020-11022"
        }
      ],
      "links": [
        {
          "url": "https://blog.jquery.com/2020/04/10/jquery-3-5-0-released/"
        },
        {
          "url": "https://jquery.com/upgrade-guide/3.5/"
        },
        {
          "url": "https://nvd.nist.gov/vuln/detail/CVE-2020-11022"
        }
      ],
      "details": {
        "vulnerable_package": {
          "name": "Vulnerable Package",
          "type": "text",
          "value": "jquery:1.6.1"
        }
      }
    },
    {
      "id": "dfc856612907051b4a85f4d646b6245af22b60583f02e8bb21418bb0991a2a90",
      "name": "Cross-site Scripting",
      "description": "In jQuery, passing HTML containing `<option>` elements from untrusted sources, even after sanitizing it, to one of jQuery's DOM manipulation methods (i.e., `.html()`, `.append()`, and others) may execute untrusted code.",
      "severity": "Medium",
      "solution": "Upgrade to version 3.5.0 or above.",
      "location": {
        "file": "node_modules/await-to-js/dist/docs/assets/js/main.js",
        "dependency": {
          "package": {
            "name": "jquery"
          },
          "version": "2.1.1"
        }
      },
      "identifiers": [
        {
          "type": "gemnasium",
          "name": "Gemnasium-1d85b518-81f3-4e17-8375-08ad1531bce1",
          "value": "1d85b518-81f3-4e17-8375-08ad1531bce1",
          "url": "https://gitlab.com/gitlab-org/security-products/gemnasium-db/-/blob/v1.2.142/npm/jquery/CVE-2020-11023.yml"
        },
        {
          "type": "cve",
          "name": "CVE-2020-11023",
          "value": "CVE-2020-11023",
          "url": "https://cve.mitre.org/cgi-bin/cvename.cgi?name=CVE-2020-11023"
        }
      ],
      "links": [
        {
          "url": "https://blog.jquery.com/2020/04/10/jquery-3-5-0-released"
        },
        {
          "url": "https://jquery.com/upgrade-guide/3.5/"
        },
        {
          "url": "https://nvd.nist.gov/vuln/detail/CVE-2020-11023"
        }
      ],
      "details": {
        "vulnerable_package": {
          "name": "Vulnerable Package",
          "type": "text",
          "value": "jquery:2.1.1"
        }
      }
    },
    {
      "id": "849941d93603d3fd31d683238dee565d8634f59ff812f05b3b6b51d06155a58a",
      "name": "Cross-site Scripting",
      "description": "In jQuery, passing HTML from untrusted sources, even after sanitizing it, to one of jQuery's DOM manipulation methods (i.e., `.html()`, `.append()`, and others) may execute untrusted code.",
      "severity": "Medium",
      "solution": "Upgrade to version 3.5.0 or above.",
      "location": {
        "file": "node_modules/await-to-js/dist/docs/assets/js/main.js",
        "dependency": {
          "package": {
            "name": "jquery"
          },
          "version": "2.1.1"
        }
      },
      "identifiers": [
        {
          "type": "gemnasium",
          "name": "Gemnasium-fd4f9aca-c215-4d5d-a6b0-13f34d3df383",
          "value": "fd4f9aca-c215-4d5d-a6b0-13f34d3df383",
          "url": "https://gitlab.com/gitlab-org/security-products/gemnasium-db/-/blob/v1.2.142/npm/jquery/CVE-2020-11022.yml"
        },
        {
          "type": "cve",
          "name": "CVE-2020-11022",
          "value": "CVE-2020-11022",
          "url": "https://cve.mitre.org/cgi-bin/cvename.cgi?name=CVE-2020-11022"
        }
      ],
      "links": [
        {
          "url": "https://blog.jquery.com/2020/04/10/jquery-3-5-0-released/"
        },
        {
          "url": "https://jquery.com/upgrade-guide/3.5/"
        },
        {
          "url": "https://nvd.nist.gov/vuln/detail/CVE-2020-11022"
        }
      ],
      "details": {
        "vulnerable_package": {
          "name": "Vulnerable Package",
          "type": "text",
          "value": "jquery:2.1.1"
        }
      }
    },
    {
      "id": "140a95427f1cb6b7a615b2076a065898b72bd0afddc13ed3f74e38b77e6af322",
      "name": "Cross-site Scripting",
      "description": "In jQuery, passing HTML containing `<option>` elements from untrusted sources, even after sanitizing it, to one of jQuery's DOM manipulation methods (i.e., `.html()`, `.append()`, and others) may execute untrusted code.",
      "severity": "Medium",
      "solution": "Upgrade to version 3.5.0 or above.",
      "location": {
        "file": "node_modules/jed/test/jquery.min.js",
        "dependency": {
          "package": {
            "name": "jquery"
          },
          "version": "1.7.1"
        }
      },
      "identifiers": [
        {
          "type": "gemnasium",
          "name": "Gemnasium-1d85b518-81f3-4e17-8375-08ad1531bce1",
          "value": "1d85b518-81f3-4e17-8375-08ad1531bce1",
          "url": "https://gitlab.com/gitlab-org/security-products/gemnasium-db/-/blob/v1.2.142/npm/jquery/CVE-2020-11023.yml"
        },
        {
          "type": "cve",
          "name": "CVE-2020-11023",
          "value": "CVE-2020-11023",
          "url": "https://cve.mitre.org/cgi-bin/cvename.cgi?name=CVE-2020-11023"
        }
      ],
      "links": [
        {
          "url": "https://blog.jquery.com/2020/04/10/jquery-3-5-0-released"
        },
        {
          "url": "https://jquery.com/upgrade-guide/3.5/"
        },
        {
          "url": "https://nvd.nist.gov/vuln/detail/CVE-2020-11023"
        }
      ],
      "details": {
        "vulnerable_package": {
          "name": "Vulnerable Package",
          "type": "text",
          "value": "jquery:1.7.1"
        }
      }
    },
    {
      "id": "5bf42f3d69d77d08cf82811e9d33932774ae5c5670a6f999babe3c0713f71e1b",
      "name": "Cross-site Scripting",
      "description": "JQuery allows Cross-site Scripting attacks via the `load` method. The `load` method fails to recognize and remove `<script>` HTML tags that contain a whitespace character such as `</script >`.",
      "severity": "Medium",
      "solution": "Upgrade to version 1.9.1 or above.",
      "location": {
        "file": "node_modules/jed/test/jquery.min.js",
        "dependency": {
          "package": {
            "name": "jquery"
          },
          "version": "1.7.1"
        }
      },
      "identifiers": [
        {
          "type": "gemnasium",
          "name": "Gemnasium-65460751-636c-4e9f-9dd3-00bfc7379043",
          "value": "65460751-636c-4e9f-9dd3-00bfc7379043",
          "url": "https://gitlab.com/gitlab-org/security-products/gemnasium-db/-/blob/v1.2.142/npm/jquery/CVE-2020-7656.yml"
        },
        {
          "type": "cve",
          "name": "CVE-2020-7656",
          "value": "CVE-2020-7656",
          "url": "https://cve.mitre.org/cgi-bin/cvename.cgi?name=CVE-2020-7656"
        }
      ],
      "links": [
        {
          "url": "https://nvd.nist.gov/vuln/detail/CVE-2020-7656"
        }
      ],
      "details": {
        "vulnerable_package": {
          "name": "Vulnerable Package",
          "type": "text",
          "value": "jquery:1.7.1"
        }
      }
    },
    {
      "id": "c0afb64fbdf7e2061fd3a719f10a52ef0a76b6ef857d27a24923f61cf6d51c65",
      "name": "Cross-site Scripting",
      "description": "In jQuery, passing HTML from untrusted sources, even after sanitizing it, to one of jQuery's DOM manipulation methods (i.e., `.html()`, `.append()`, and others) may execute untrusted code.",
      "severity": "Medium",
      "solution": "Upgrade to version 3.5.0 or above.",
      "location": {
        "file": "node_modules/jed/test/jquery.min.js",
        "dependency": {
          "package": {
            "name": "jquery"
          },
          "version": "1.7.1"
        }
      },
      "identifiers": [
        {
          "type": "gemnasium",
          "name": "Gemnasium-fd4f9aca-c215-4d5d-a6b0-13f34d3df383",
          "value": "fd4f9aca-c215-4d5d-a6b0-13f34d3df383",
          "url": "https://gitlab.com/gitlab-org/security-products/gemnasium-db/-/blob/v1.2.142/npm/jquery/CVE-2020-11022.yml"
        },
        {
          "type": "cve",
          "name": "CVE-2020-11022",
          "value": "CVE-2020-11022",
          "url": "https://cve.mitre.org/cgi-bin/cvename.cgi?name=CVE-2020-11022"
        }
      ],
      "links": [
        {
          "url": "https://blog.jquery.com/2020/04/10/jquery-3-5-0-released/"
        },
        {
          "url": "https://jquery.com/upgrade-guide/3.5/"
        },
        {
          "url": "https://nvd.nist.gov/vuln/detail/CVE-2020-11022"
        }
      ],
      "details": {
        "vulnerable_package": {
          "name": "Vulnerable Package",
          "type": "text",
          "value": "jquery:1.7.1"
        }
      }
    },
    {
      "id": "7d317260c97d6702c325e139ff2cc2a1705f475773fc23e2f388548f05d14daa",
      "name": "Uncontrolled Resource Consumption",
      "description": "lodash is affected by Uncontrolled Resource Consumption which can lead to a denial of service.",
      "severity": "Medium",
      "solution": "Upgrade to version 4.17.11 or above.",
      "location": {
        "file": "package-lock.json",
        "dependency": {
          "package": {
            "name": "lodash"
          },
          "version": "4.17.10"
        }
      },
      "identifiers": [
        {
          "type": "gemnasium",
          "name": "Gemnasium-109f3b4c-bdb3-48be-b2f9-e0348fba64bd",
          "value": "109f3b4c-bdb3-48be-b2f9-e0348fba64bd",
          "url": "https://gitlab.com/gitlab-org/security-products/gemnasium-db/-/blob/v1.2.142/npm/lodash/CVE-2019-1010266.yml"
        },
        {
          "type": "cve",
          "name": "CVE-2019-1010266",
          "value": "CVE-2019-1010266",
          "url": "https://cve.mitre.org/cgi-bin/cvename.cgi?name=CVE-2019-1010266"
        }
      ],
      "links": [
        {
          "url": "https://github.com/lodash/lodash/issues/3359"
        },
        {
          "url": "https://nvd.nist.gov/vuln/detail/CVE-2019-1010266"
        }
      ],
      "details": {
        "vulnerable_package": {
          "name": "Vulnerable Package",
          "type": "text",
          "value": "lodash:4.17.10"
        }
      }
    },
    {
      "id": "495e5d73a2c058aed3cfe771541c7c31f0f17252b4ed204ad4aa4c350d7c785d",
      "name": "Improper Input Validation",
      "description": "minimist could be tricked into adding or modifying properties of `Object.prototype` using a `constructor` or `__proto__` payload.",
      "severity": "Medium",
      "solution": "Upgrade to version 1.2.2 or above.",
      "location": {
        "file": "package-lock.json",
        "dependency": {
          "package": {
            "name": "minimist"
          },
          "version": "0.0.8"
        }
      },
      "identifiers": [
        {
          "type": "gemnasium",
          "name": "Gemnasium-53e8766c-27eb-4278-8c4f-3dcef53a68bf",
          "value": "53e8766c-27eb-4278-8c4f-3dcef53a68bf",
          "url": "https://gitlab.com/gitlab-org/security-products/gemnasium-db/-/blob/v1.2.142/npm/minimist/CVE-2020-7598.yml"
        },
        {
          "type": "cve",
          "name": "CVE-2020-7598",
          "value": "CVE-2020-7598",
          "url": "https://cve.mitre.org/cgi-bin/cvename.cgi?name=CVE-2020-7598"
        }
      ],
      "links": [
        {
          "url": "https://nvd.nist.gov/vuln/detail/CVE-2020-7598"
        }
      ],
      "details": {
        "vulnerable_package": {
          "name": "Vulnerable Package",
          "type": "text",
          "value": "minimist:0.0.8"
        }
      }
    },
    {
      "id": "0cadb94bf56a1b1f061fe8c80301f6c7367598d91f3a8ef7eafafb7497849b01",
      "name": "Improper Input Validation",
      "description": "yargs-parser could be tricked into adding or modifying properties of `Object.prototype` using a `__proto__` payload.",
      "severity": "Medium",
      "solution": "Upgrade to versions 13.1.2, 15.0.1, 18.1.1 or above.",
      "location": {
        "file": "package-lock.json",
        "dependency": {
          "package": {
            "name": "yargs-parser"
          },
          "version": "8.1.0"
        }
      },
      "identifiers": [
        {
          "type": "gemnasium",
          "name": "Gemnasium-a9e73366-2694-40b0-bcc1-795368307084",
          "value": "a9e73366-2694-40b0-bcc1-795368307084",
          "url": "https://gitlab.com/gitlab-org/security-products/gemnasium-db/-/blob/v1.2.142/npm/yargs-parser/CVE-2020-7608.yml"
        },
        {
          "type": "cve",
          "name": "CVE-2020-7608",
          "value": "CVE-2020-7608",
          "url": "https://cve.mitre.org/cgi-bin/cvename.cgi?name=CVE-2020-7608"
        }
      ],
      "links": [
        {
          "url": "https://nvd.nist.gov/vuln/detail/CVE-2020-7608"
        }
      ],
      "details": {
        "vulnerable_package": {
          "name": "Vulnerable Package",
          "type": "text",
          "value": "yargs-parser:8.1.0"
        }
      }
    },
    {
      "id": "1519df40378949cd523fafe47f146e985419624b8ac48e97f35bf9c1b5bfb006",
      "name": "Improper Input Validation",
      "description": "yargs-parser could be tricked into adding or modifying properties of `Object.prototype` using a `__proto__` payload.",
      "severity": "Medium",
      "solution": "Upgrade to versions 13.1.2, 15.0.1, 18.1.1 or above.",
      "location": {
        "file": "package-lock.json",
        "dependency": {
          "package": {
            "name": "yargs-parser"
          },
          "version": "9.0.2"
        }
      },
      "identifiers": [
        {
          "type": "gemnasium",
          "name": "Gemnasium-a9e73366-2694-40b0-bcc1-795368307084",
          "value": "a9e73366-2694-40b0-bcc1-795368307084",
          "url": "https://gitlab.com/gitlab-org/security-products/gemnasium-db/-/blob/v1.2.142/npm/yargs-parser/CVE-2020-7608.yml"
        },
        {
          "type": "cve",
          "name": "CVE-2020-7608",
          "value": "CVE-2020-7608",
          "url": "https://cve.mitre.org/cgi-bin/cvename.cgi?name=CVE-2020-7608"
        }
      ],
      "links": [
        {
          "url": "https://nvd.nist.gov/vuln/detail/CVE-2020-7608"
        }
      ],
      "details": {
        "vulnerable_package": {
          "name": "Vulnerable Package",
          "type": "text",
          "value": "yargs-parser:9.0.2"
        }
      }
    },
    {
      "id": "8f21f6035ef1bff06d6806e8afe88018f53a333e7411cfb4fa8a8b225f221967",
      "name": "Exceeding Stack Call Limit DoS",
      "description": "A lowercasing logic is used on the attribute names. Because of this, boolean attributes whose names are not all lowercase cause infinite recursion, and will exceed the stack call limit.",
      "severity": "Unknown",
      "solution": "Upgrade to v3.0.0 or greater.",
      "location": {
        "file": "node_modules/JSONSelect/site/js/jquery-1.6.1.min.js",
        "dependency": {
          "package": {
            "name": "jquery"
          },
          "version": "1.6.1"
        }
      },
      "identifiers": [
        {
          "type": "gemnasium",
          "name": "Gemnasium-2e35e0f3-7716-4241-a56a-44025f0d66cb",
          "value": "2e35e0f3-7716-4241-a56a-44025f0d66cb",
          "url": "https://gitlab.com/gitlab-org/security-products/gemnasium-db/-/blob/v1.2.142/npm/jquery/GMS-2016-33.yml"
        }
      ],
      "links": [
        {
          "url": "https://github.com/jquery/jquery/issues/3133"
        },
        {
          "url": "https://nodesecurity.io/advisories/330"
        }
      ],
      "details": {
        "vulnerable_package": {
          "name": "Vulnerable Package",
          "type": "text",
          "value": "jquery:1.6.1"
        }
      }
    },
    {
      "id": "fd4e553876e510d8f15736f2d3a0d22ca8791562e4d939bdd1e26f1e8f1032ee",
      "name": "XSS",
      "description": "When text/javascript responses are received from cross-origin ajax requests not containing the option `dataType`, the result is executed in `jQuery.globalEval` potentially allowing an attacker to execute arbitrary code on the origin.",
      "severity": "Unknown",
      "solution": "Upgrade to v3.0.0 or greater.",
      "location": {
        "file": "node_modules/JSONSelect/site/js/jquery-1.6.1.min.js",
        "dependency": {
          "package": {
            "name": "jquery"
          },
          "version": "1.6.1"
        }
      },
      "identifiers": [
        {
          "type": "gemnasium",
          "name": "Gemnasium-64559551-a08a-4af6-ab2e-80980dbfbf7d",
          "value": "64559551-a08a-4af6-ab2e-80980dbfbf7d",
          "url": "https://gitlab.com/gitlab-org/security-products/gemnasium-db/-/blob/v1.2.142/npm/jquery/GMS-2017-122.yml"
        }
      ],
      "links": [
        {
          "url": "https://nodesecurity.io/advisories/328"
        }
      ],
      "details": {
        "vulnerable_package": {
          "name": "Vulnerable Package",
          "type": "text",
          "value": "jquery:1.6.1"
        }
      }
    },
    {
      "id": "877e2470443373f3a263c2e1f69831a5568cdbc9741029e150cfb0fe79ec5a58",
      "name": "Exceeding Stack Call Limit DoS",
      "description": "A lowercasing logic is used on the attribute names. Because of this, boolean attributes whose names are not all lowercase cause infinite recursion, and will exceed the stack call limit.",
      "severity": "Unknown",
      "solution": "Upgrade to v3.0.0 or greater.",
      "location": {
        "file": "node_modules/JSONSelect/src/test/js/jquery-1.6.1.min.js",
        "dependency": {
          "package": {
            "name": "jquery"
          },
          "version": "1.6.1"
        }
      },
      "identifiers": [
        {
          "type": "gemnasium",
          "name": "Gemnasium-2e35e0f3-7716-4241-a56a-44025f0d66cb",
          "value": "2e35e0f3-7716-4241-a56a-44025f0d66cb",
          "url": "https://gitlab.com/gitlab-org/security-products/gemnasium-db/-/blob/v1.2.142/npm/jquery/GMS-2016-33.yml"
        }
      ],
      "links": [
        {
          "url": "https://github.com/jquery/jquery/issues/3133"
        },
        {
          "url": "https://nodesecurity.io/advisories/330"
        }
      ],
      "details": {
        "vulnerable_package": {
          "name": "Vulnerable Package",
          "type": "text",
          "value": "jquery:1.6.1"
        }
      }
    },
    {
      "id": "c95b2fba028322620a2bb34c744b290649fb1edd974cf799be6624594d870f4b",
      "name": "XSS",
      "description": "When text/javascript responses are received from cross-origin ajax requests not containing the option `dataType`, the result is executed in `jQuery.globalEval` potentially allowing an attacker to execute arbitrary code on the origin.",
      "severity": "Unknown",
      "solution": "Upgrade to v3.0.0 or greater.",
      "location": {
        "file": "node_modules/JSONSelect/src/test/js/jquery-1.6.1.min.js",
        "dependency": {
          "package": {
            "name": "jquery"
          },
          "version": "1.6.1"
        }
      },
      "identifiers": [
        {
          "type": "gemnasium",
          "name": "Gemnasium-64559551-a08a-4af6-ab2e-80980dbfbf7d",
          "value": "64559551-a08a-4af6-ab2e-80980dbfbf7d",
          "url": "https://gitlab.com/gitlab-org/security-products/gemnasium-db/-/blob/v1.2.142/npm/jquery/GMS-2017-122.yml"
        }
      ],
      "links": [
        {
          "url": "https://nodesecurity.io/advisories/328"
        }
      ],
      "details": {
        "vulnerable_package": {
          "name": "Vulnerable Package",
          "type": "text",
          "value": "jquery:1.6.1"
        }
      }
    },
    {
      "id": "2e322fd78523dc76cd09eff8fa4c8fd3a3bebc5856793c1c1c4e13aa7fea49cd",
      "name": "Exceeding Stack Call Limit DoS",
      "description": "A lowercasing logic is used on the attribute names. Because of this, boolean attributes whose names are not all lowercase cause infinite recursion, and will exceed the stack call limit.",
      "severity": "Unknown",
      "solution": "Upgrade to v3.0.0 or greater.",
      "location": {
        "file": "node_modules/await-to-js/dist/docs/assets/js/main.js",
        "dependency": {
          "package": {
            "name": "jquery"
          },
          "version": "2.1.1"
        }
      },
      "identifiers": [
        {
          "type": "gemnasium",
          "name": "Gemnasium-2e35e0f3-7716-4241-a56a-44025f0d66cb",
          "value": "2e35e0f3-7716-4241-a56a-44025f0d66cb",
          "url": "https://gitlab.com/gitlab-org/security-products/gemnasium-db/-/blob/v1.2.142/npm/jquery/GMS-2016-33.yml"
        }
      ],
      "links": [
        {
          "url": "https://github.com/jquery/jquery/issues/3133"
        },
        {
          "url": "https://nodesecurity.io/advisories/330"
        }
      ],
      "details": {
        "vulnerable_package": {
          "name": "Vulnerable Package",
          "type": "text",
          "value": "jquery:2.1.1"
        }
      }
    },
    {
      "id": "3d05fb8b910acce784100f588a31e456127957f0b39680235e3df1c12b1c994f",
      "name": "XSS",
      "description": "When text/javascript responses are received from cross-origin ajax requests not containing the option `dataType`, the result is executed in `jQuery.globalEval` potentially allowing an attacker to execute arbitrary code on the origin.",
      "severity": "Unknown",
      "solution": "Upgrade to v3.0.0 or greater.",
      "location": {
        "file": "node_modules/await-to-js/dist/docs/assets/js/main.js",
        "dependency": {
          "package": {
            "name": "jquery"
          },
          "version": "2.1.1"
        }
      },
      "identifiers": [
        {
          "type": "gemnasium",
          "name": "Gemnasium-64559551-a08a-4af6-ab2e-80980dbfbf7d",
          "value": "64559551-a08a-4af6-ab2e-80980dbfbf7d",
          "url": "https://gitlab.com/gitlab-org/security-products/gemnasium-db/-/blob/v1.2.142/npm/jquery/GMS-2017-122.yml"
        }
      ],
      "links": [
        {
          "url": "https://nodesecurity.io/advisories/328"
        }
      ],
      "details": {
        "vulnerable_package": {
          "name": "Vulnerable Package",
          "type": "text",
          "value": "jquery:2.1.1"
        }
      }
    },
    {
      "id": "68058ef466d13c2fefcb28c8ccad2bf8625c5ba741a79ac9aca59cc81f5f6a92",
      "name": "XSS via improper selector detection",
      "description": "jQuery's main method in affected versions contains an unreliable way of detecting whether the input to the `jQuery(strInput)` function is intended to be a selector or HTML.",
      "severity": "Unknown",
      "solution": "Upgrade to v1.9.0 or greater.",
      "location": {
        "file": "node_modules/jed/test/jquery.min.js",
        "dependency": {
          "package": {
            "name": "jquery"
          },
          "version": "1.7.1"
        }
      },
      "identifiers": [
        {
          "type": "gemnasium",
          "name": "Gemnasium-04a14325-f5d9-4711-aee7-cf19ed54b0d2",
          "value": "04a14325-f5d9-4711-aee7-cf19ed54b0d2",
          "url": "https://gitlab.com/gitlab-org/security-products/gemnasium-db/-/blob/v1.2.142/npm/jquery/GMS-2017-121.yml"
        }
      ],
      "links": [
        {
          "url": "https://bugs.jquery.com/ticket/11290"
        },
        {
          "url": "https://nodesecurity.io/advisories/329"
        }
      ],
      "details": {
        "vulnerable_package": {
          "name": "Vulnerable Package",
          "type": "text",
          "value": "jquery:1.7.1"
        }
      }
    },
    {
      "id": "3d5e081846c9f66cd7289197eefb00c7ba8724f8ad16e172a6ae77c9423c18c7",
      "name": "Exceeding Stack Call Limit DoS",
      "description": "A lowercasing logic is used on the attribute names. Because of this, boolean attributes whose names are not all lowercase cause infinite recursion, and will exceed the stack call limit.",
      "severity": "Unknown",
      "solution": "Upgrade to v3.0.0 or greater.",
      "location": {
        "file": "node_modules/jed/test/jquery.min.js",
        "dependency": {
          "package": {
            "name": "jquery"
          },
          "version": "1.7.1"
        }
      },
      "identifiers": [
        {
          "type": "gemnasium",
          "name": "Gemnasium-2e35e0f3-7716-4241-a56a-44025f0d66cb",
          "value": "2e35e0f3-7716-4241-a56a-44025f0d66cb",
          "url": "https://gitlab.com/gitlab-org/security-products/gemnasium-db/-/blob/v1.2.142/npm/jquery/GMS-2016-33.yml"
        }
      ],
      "links": [
        {
          "url": "https://github.com/jquery/jquery/issues/3133"
        },
        {
          "url": "https://nodesecurity.io/advisories/330"
        }
      ],
      "details": {
        "vulnerable_package": {
          "name": "Vulnerable Package",
          "type": "text",
          "value": "jquery:1.7.1"
        }
      }
    },
    {
      "id": "897928e100e142af2181909fb896d9001c267a6ccbb1ef1bd7500afef3af3c18",
      "name": "XSS",
      "description": "When text/javascript responses are received from cross-origin ajax requests not containing the option `dataType`, the result is executed in `jQuery.globalEval` potentially allowing an attacker to execute arbitrary code on the origin.",
      "severity": "Unknown",
      "solution": "Upgrade to v3.0.0 or greater.",
      "location": {
        "file": "node_modules/jed/test/jquery.min.js",
        "dependency": {
          "package": {
            "name": "jquery"
          },
          "version": "1.7.1"
        }
      },
      "identifiers": [
        {
          "type": "gemnasium",
          "name": "Gemnasium-64559551-a08a-4af6-ab2e-80980dbfbf7d",
          "value": "64559551-a08a-4af6-ab2e-80980dbfbf7d",
          "url": "https://gitlab.com/gitlab-org/security-products/gemnasium-db/-/blob/v1.2.142/npm/jquery/GMS-2017-122.yml"
        }
      ],
      "links": [
        {
          "url": "https://nodesecurity.io/advisories/328"
        }
      ],
      "details": {
        "vulnerable_package": {
          "name": "Vulnerable Package",
          "type": "text",
          "value": "jquery:1.7.1"
        }
      }
    },
    {
      "id": "d46af1f7b1632f82d8e06019879d18f17b7fe0d31a1763214364df139da5af8e",
      "name": "Regular Expression Denial of Service",
      "description": "Decamelize uses regular expressions to evaluate a string and takes unescaped separator values, which can be used to create a denial of service attack.",
      "severity": "Unknown",
      "solution": "Upgrade to version 1.1.2 or later.",
      "location": {
        "file": "package-lock.json",
        "dependency": {
          "package": {
            "name": "decamelize"
          },
          "version": "1.1.1"
        }
      },
      "identifiers": [
        {
          "type": "gemnasium",
          "name": "Gemnasium-980f208d-a755-46f3-8bac-4decf4c48f56",
          "value": "980f208d-a755-46f3-8bac-4decf4c48f56",
          "url": "https://gitlab.com/gitlab-org/security-products/gemnasium-db/-/blob/v1.2.142/npm/decamelize/GMS-2015-53.yml"
        }
      ],
      "links": [
        {
          "url": "https://github.com/sindresorhus/decamelize/issues/5"
        },
        {
          "url": "https://nodesecurity.io/advisories/308"
        }
      ],
      "details": {
        "vulnerable_package": {
          "type": "text",
          "name": "Vulnerable Package",
          "value": "decamelize:1.1.1"
        }
      }
    }
  ],
  "scan": {
    "analyzer": {
      "id": "gemnasium",
      "name": "Gemnasium",
      "url": "https://gitlab.com/gitlab-org/security-products/analyzers/gemnasium",
      "vendor": {
        "name": "GitLab"
      },
      "version": "3.10.7"
    },
    "scanner": {
      "id": "gemnasium",
      "name": "Gemnasium",
      "url": "https://gitlab.com/gitlab-org/security-products/analyzers/gemnasium",
      "vendor": {
        "name": "GitLab"
      },
      "version": "2.33.0"
    },
    "type": "dependency_scanning",
    "start_time": "2022-02-16T04:37:29",
    "end_time": "2022-02-16T04:37:32",
    "status": "success"
  }
}
