[
  {
    "name": "net.sf.trove4j/trove4j",
    "version": "3.0.3"
  },
  {
    "name": "org.tensorflow/tensorflow",
    "version": "1.12.0"
  },
  {
    "name": "org.tensorflow/libtensorflow",
    "version": "1.12.0"
  },
  {
    "name": "org.json4s/json4s-ext",
    "version": "3.5.3"
  },
  {
    "name": "org.joda/joda-convert",
    "version": "1.8.1"
  },
  {
    "name": "joda-time/joda-time",
    "version": "2.8.1"
  },
  {
    "name": "com.navigamez/greex",
    "version": "1.0"
  },
  {
    "name": "dk.brics.automaton/automaton",
    "version": "1.11-8"
  },
  {
    "name": "com.github.universal-automata/liblevenshtein",
    "version": "3.0.0"
  },
  {
    "name": "org.slf4j/slf4j-api",
    "version": "1.7.21"
  },
  {
    "name": "org.projectlombok/lombok",
    "version": "1.16.8"
  },
  {
    "name": "it.unimi.dsi/fastutil",
    "version": "7.0.12"
  },
  {
    "name": "com.google.protobuf/protobuf-java-util",
    "version": "3.0.0-beta-3"
  },
  {
    "name": "com.google.code.gson/gson",
    "version": "2.3"
  },
  {
    "name": "com.google.protobuf/protobuf-java",
    "version": "3.0.0-beta-3"
  },
  {
    "name": "com.google.code.findbugs/annotations",
    "version": "3.0.1"
  },
  {
    "name": "com.google.code.findbugs/jsr305",
    "version": "3.0.1"
  },
  {
    "name": "net.jcip/jcip-annotations",
    "version": "1.0"
  },
  {
    "name": "com.amazonaws/aws-java-sdk-s3",
    "version": "1.11.603"
  },
  {
    "name": "com.amazonaws/aws-java-sdk-kms",
    "version": "1.11.603"
  },
  {
    "name": "com.amazonaws/jmespath-java",
    "version": "1.11.603"
  },
  {
    "name": "com.amazonaws/aws-java-sdk-core",
    "version": "1.11.603"
  },
  {
    "name": "com.fasterxml.jackson.dataformat/jackson-dataformat-cbor",
    "version": "2.6.7"
  },
  {
    "name": "com.fasterxml.jackson.core/jackson-databind",
    "version": "2.6.7.2"
  },
  {
    "name": "com.fasterxml.jackson.core/jackson-core",
    "version": "2.6.7"
  },
  {
    "name": "com.fasterxml.jackson.core/jackson-annotations",
    "version": "2.6.0"
  },
  {
    "name": "software.amazon.ion/ion-java",
    "version": "1.0.2"
  },
  {
    "name": "org.apache.httpcomponents/httpclient",
    "version": "4.5.9"
  },
  {
    "name": "commons-codec/commons-codec",
    "version": "1.11"
  },
  {
    "name": "org.apache.httpcomponents/httpcore",
    "version": "4.4.11"
  },
  {
    "name": "commons-logging/commons-logging",
    "version": "1.2"
  },
  {
    "name": "org.apache.hadoop/hadoop-aws",
    "version": "3.2.0"
  },
  {
    "name": "org.rocksdb/rocksdbjni",
    "version": "5.17.2"
  },
  {
    "name": "com.typesafe/config",
    "version": "1.3.0"
  },
  {
    "name": "org.scala-lang/scala-library",
    "version": "2.11.12"
  }
]
