module gitlab.com/gitlab-org/ci-cd/shared-runners/images/aws/grit-images

go 1.23

require (
	github.com/aws/aws-sdk-go-v2 v1.36.0
	github.com/aws/aws-sdk-go-v2/config v1.29.4
	github.com/aws/aws-sdk-go-v2/service/ec2 v1.202.2
	github.com/urfave/cli/v2 v2.27.5
	gitlab.com/gitlab-org/api/client-go v0.121.0
)

require (
	github.com/aws/aws-sdk-go-v2/credentials v1.17.57 // indirect
	github.com/aws/aws-sdk-go-v2/feature/ec2/imds v1.16.27 // indirect
	github.com/aws/aws-sdk-go-v2/internal/configsources v1.3.31 // indirect
	github.com/aws/aws-sdk-go-v2/internal/endpoints/v2 v2.6.31 // indirect
	github.com/aws/aws-sdk-go-v2/internal/ini v1.8.2 // indirect
	github.com/aws/aws-sdk-go-v2/service/internal/accept-encoding v1.12.2 // indirect
	github.com/aws/aws-sdk-go-v2/service/internal/presigned-url v1.12.12 // indirect
	github.com/aws/aws-sdk-go-v2/service/sso v1.24.14 // indirect
	github.com/aws/aws-sdk-go-v2/service/ssooidc v1.28.13 // indirect
	github.com/aws/aws-sdk-go-v2/service/sts v1.33.12 // indirect
	github.com/aws/smithy-go v1.22.2 // indirect
	github.com/cpuguy83/go-md2man/v2 v2.0.6 // indirect
	github.com/google/go-querystring v1.1.0 // indirect
	github.com/hashicorp/go-cleanhttp v0.5.2 // indirect
	github.com/hashicorp/go-retryablehttp v0.7.7 // indirect
	github.com/russross/blackfriday/v2 v2.1.0 // indirect
	github.com/xrash/smetrics v0.0.0-20240521201337-686a1a2994c1 // indirect
	golang.org/x/oauth2 v0.25.0 // indirect
	golang.org/x/time v0.9.0 // indirect
)
