module gitlab.com/gitlab-org/ci-cd/runner-tools/grit

go 1.23

require (
	github.com/gruntwork-io/terratest v0.48.1
	github.com/stretchr/testify v1.10.0
	gitlab.com/gitlab-org/api/client-go v0.119.0
)

require (
	github.com/hashicorp/go-getter/v2 v2.2.3 // indirect
	github.com/kr/pretty v0.3.1 // indirect
	github.com/rogpeppe/go-internal v1.12.0 // indirect
	golang.org/x/mod v0.21.0 // indirect
	golang.org/x/tools v0.26.0 // indirect
	gopkg.in/check.v1 v1.0.0-20201130134442-10cb98267c6c // indirect
)

require (
	github.com/agext/levenshtein v1.2.3 // indirect
	github.com/apparentlymart/go-textseg/v15 v15.0.0 // indirect
	github.com/bgentry/go-netrc v0.0.0-20140422174119-9fd32a8b3d3d // indirect
	github.com/cenkalti/backoff/v5 v5.0.1
	github.com/davecgh/go-spew v1.1.2-0.20180830191138-d8f796af33cc // indirect
	github.com/google/go-querystring v1.1.0 // indirect
	github.com/hashicorp/errwrap v1.0.0 // indirect
	github.com/hashicorp/go-cleanhttp v0.5.2 // indirect
	github.com/hashicorp/go-multierror v1.1.1 // indirect
	github.com/hashicorp/go-retryablehttp v0.7.7 // indirect
	github.com/hashicorp/go-safetemp v1.0.0 // indirect
	github.com/hashicorp/go-version v1.7.0 // indirect
	github.com/hashicorp/hcl/v2 v2.22.0 // indirect
	github.com/hashicorp/terraform-exec v0.21.0
	github.com/hashicorp/terraform-json v0.23.0 // indirect
	github.com/jinzhu/copier v0.0.0-20190924061706-b57f9002281a // indirect
	github.com/klauspost/compress v1.16.5 // indirect
	github.com/magefile/mage v1.15.0
	github.com/mattn/go-zglob v0.0.2-0.20190814121620-e3c945676326 // indirect
	github.com/mitchellh/go-homedir v1.1.0 // indirect
	github.com/mitchellh/go-testing-interface v1.14.1 // indirect
	github.com/mitchellh/go-wordwrap v1.0.1 // indirect
	github.com/pmezard/go-difflib v1.0.1-0.20181226105442-5d4384ee4fb2 // indirect
	github.com/tmccombs/hcl2json v0.6.4 // indirect
	github.com/ulikunitz/xz v0.5.10 // indirect
	github.com/zclconf/go-cty v1.15.0 // indirect
	golang.org/x/crypto v0.29.0 // indirect
	golang.org/x/net v0.31.0 // indirect
	golang.org/x/oauth2 v0.25.0 // indirect
	golang.org/x/sync v0.9.0 // indirect
	golang.org/x/sys v0.27.0 // indirect
	golang.org/x/text v0.20.0 // indirect
	golang.org/x/time v0.9.0 // indirect
	gopkg.in/yaml.v3 v3.0.1 // indirect
)
