{
  "object_kind": "merge_request",
  "event_type": "merge_request",
  "user": {
    "name": "Steve Azzopardi",
    "username": "steveazz",
    "avatar_url": "https://secure.gravatar.com/avatar/4a5eeed7ec5c80642df9ee708bb496d7?s=80\u0026d=identicon",
    "email": "sazzopardi@gitlab.com"
  },
  "project": {
    "id": 17630954,
    "name": "merge-request-bot-test",
    "description": "",
    "web_url": "https://gitlab.com/steveazz/merge-request-bot-test",
    "avatar_url": null,
    "git_ssh_url": "git@gitlab.com:steveazz/merge-request-bot-test.git",
    "git_http_url": "https://gitlab.com/steveazz/merge-request-bot-test.git",
    "namespace": "Steve Azzopardi",
    "visibility_level": 20,
    "path_with_namespace": "steveazz/merge-request-bot-test",
    "default_branch": "master",
    "ci_config_path": null,
    "homepage": "https://gitlab.com/steveazz/merge-request-bot-test",
    "url": "git@gitlab.com:steveazz/merge-request-bot-test.git",
    "ssh_url": "git@gitlab.com:steveazz/merge-request-bot-test.git",
    "http_url": "https://gitlab.com/steveazz/merge-request-bot-test.git"
  },
  "object_attributes": {
    "assignee_id": null,
    "author_id": 210928,
    "created_at": "2020-03-21 19:13:45 UTC",
    "description": "",
    "head_pipeline_id": null,
    "id": 53210163,
    "iid": 1,
    "last_edited_at": null,
    "last_edited_by_id": null,
    "merge_commit_sha": "53a465b13cf4d0980cdcf6fcd9e051eed80e790c",
    "merge_error": null,
    "merge_params": {
      "force_remove_source_branch": "1"
    },
    "merge_status": "can_be_merged",
    "merge_user_id": null,
    "merge_when_pipeline_succeeds": false,
    "milestone_id": null,
    "source_branch": "steveazz-master-patch-42023",
    "source_project_id": 17630954,
    "state_id": 3,
    "target_branch": "master",
    "target_project_id": 17630954,
    "time_estimate": 0,
    "title": "Update hello.txt",
    "updated_at": "2020-03-21 19:13:57 UTC",
    "updated_by_id": null,
    "url": "https://gitlab.com/steveazz/merge-request-bot-test/-/merge_requests/1",
    "source": {
      "id": 17630954,
      "name": "merge-request-bot-test",
      "description": "",
      "web_url": "https://gitlab.com/steveazz/merge-request-bot-test",
      "avatar_url": null,
      "git_ssh_url": "git@gitlab.com:steveazz/merge-request-bot-test.git",
      "git_http_url": "https://gitlab.com/steveazz/merge-request-bot-test.git",
      "namespace": "Steve Azzopardi",
      "visibility_level": 20,
      "path_with_namespace": "steveazz/merge-request-bot-test",
      "default_branch": "master",
      "ci_config_path": null,
      "homepage": "https://gitlab.com/steveazz/merge-request-bot-test",
      "url": "git@gitlab.com:steveazz/merge-request-bot-test.git",
      "ssh_url": "git@gitlab.com:steveazz/merge-request-bot-test.git",
      "http_url": "https://gitlab.com/steveazz/merge-request-bot-test.git"
    },
    "target": {
      "id": 17630954,
      "name": "merge-request-bot-test",
      "description": "",
      "web_url": "https://gitlab.com/steveazz/merge-request-bot-test",
      "avatar_url": null,
      "git_ssh_url": "git@gitlab.com:steveazz/merge-request-bot-test.git",
      "git_http_url": "https://gitlab.com/steveazz/merge-request-bot-test.git",
      "namespace": "Steve Azzopardi",
      "visibility_level": 20,
      "path_with_namespace": "steveazz/merge-request-bot-test",
      "default_branch": "master",
      "ci_config_path": null,
      "homepage": "https://gitlab.com/steveazz/merge-request-bot-test",
      "url": "git@gitlab.com:steveazz/merge-request-bot-test.git",
      "ssh_url": "git@gitlab.com:steveazz/merge-request-bot-test.git",
      "http_url": "https://gitlab.com/steveazz/merge-request-bot-test.git"
    },
    "last_commit": {
      "id": "fc1f3c25f449c82fb5b1f87605bee3a81ca58d2c",
      "message": "Update hello.txt",
      "title": "Update hello.txt",
      "timestamp": "2020-03-21T19:12:30+00:00",
      "url": "https://gitlab.com/steveazz/merge-request-bot-test/-/commit/fc1f3c25f449c82fb5b1f87605bee3a81ca58d2c",
      "author": {
        "name": "Steve Azzopardi",
        "email": "sazzopardi@gitlab.com"
      }
    },
    "work_in_progress": false,
    "total_time_spent": 0,
    "human_total_time_spent": null,
    "human_time_estimate": null,
    "assignee_ids": [],
    "state": "merged",
    "action": "merge"
  },
  "labels": [],
  "changes": {
    "state_id": {
      "previous": 4,
      "current": 3
    },
    "updated_at": {
      "previous": "2020-03-21 19:13:57 UTC",
      "current": "2020-03-21 19:13:57 UTC"
    },
    "total_time_spent": {
      "previous": null,
      "current": 0
    }
  },
  "repository": {
    "name": "merge-request-bot-test",
    "url": "git@gitlab.com:steveazz/merge-request-bot-test.git",
    "description": "",
    "homepage": "https://gitlab.com/steveazz/merge-request-bot-test"
  }
}
