module gitlab.com/gitlab-org/ci-cd/custom-executor-drivers/fargate

go 1.21

require (
	github.com/BurntSushi/toml v1.3.2
	github.com/aws/aws-sdk-go v1.51.14
	github.com/jpillora/backoff v1.0.0
	github.com/jstemmer/go-junit-report v0.9.1
	github.com/mitchellh/gox v1.0.1
	github.com/sirupsen/logrus v1.9.0
	github.com/spf13/afero v1.2.2
	github.com/stretchr/testify v1.7.0
	github.com/urfave/cli v1.22.2
	gitlab.com/ayufan/golang-cli-helpers v0.0.0-20171103152739-a7cf72d604cd
	gitlab.com/gitlab-org/gitlab-runner v12.5.0+incompatible
	golang.org/x/crypto v0.15.0
)

require (
	github.com/cpuguy83/go-md2man/v2 v2.0.0-20190314233015-f79a8a8ca69d // indirect
	github.com/davecgh/go-spew v1.1.1 // indirect
	github.com/hashicorp/go-version v1.0.0 // indirect
	github.com/jmespath/go-jmespath v0.4.0 // indirect
	github.com/mitchellh/iochan v1.0.0 // indirect
	github.com/pmezard/go-difflib v1.0.0 // indirect
	github.com/russross/blackfriday/v2 v2.0.1 // indirect
	github.com/shurcooL/sanitized_anchor_name v1.0.0 // indirect
	github.com/stretchr/objx v0.1.1 // indirect
	golang.org/x/sys v0.14.0 // indirect
	golang.org/x/text v0.14.0 // indirect
	gopkg.in/yaml.v3 v3.0.0-20200313102051-9f266ea9e77c // indirect
)
