{
  "project_ids": ["gitlab_project_1", "gitlab_project_2"],
  "funnels": [
    {
      "name": "completed_purchase",
      "schema": "[   {\"name\": \"completed_purchase\",\"sql\": \"      SELECT\n        (SELECT max(derived_tstamp) FROM gitlab_project_1.snowplow_events) as x,\n        windowFunnel(3600)(toDateTime(derived_tstamp), page_urlpath = '/page1.html', page_urlpath = '/page2.html', page_urlpath = '/page3.html') as step\n        FROM gitlab_project_1.snowplow_events\n\",\"steps\": [\"page_urlpath = '/page1.html'\",\"page_urlpath = '/page2.html'\",\"page_urlpath = '/page3.html'\"]}]",
      "state": "created"
    },
    {
      "name": "completed_purchase_v2",
      "schema": "[   {\"name\": \"completed_purchase\",\"sql\": \"      SELECT\n        (SELECT max(derived_tstamp) FROM gitlab_project_1.snowplow_events) as x,\n        windowFunnel(3600)(toDateTime(derived_tstamp), page_urlpath = '/page1.html', page_urlpath = '/page2.html', page_urlpath = '/page3.html') as step\n        FROM gitlab_project_1.snowplow_events\n\",\"steps\": [\"page_urlpath = '/page1_v2.html'\",\"page_urlpath = '/page2_v2.html'\",\"page_urlpath = '/page3_v2.html'\"]}]",
      "state": "updated"
    },
    {
      "name": "completed_purchase_new",
      "previous_name": "completed_purchase_old",
      "schema": "[   {\"name\": \"completed_purchase\",\"sql\": \"      SELECT\n        (SELECT max(derived_tstamp) FROM gitlab_project_1.snowplow_events) as x,\n        windowFunnel(3600)(toDateTime(derived_tstamp), page_urlpath = '/page1.html', page_urlpath = '/page2.html', page_urlpath = '/page3.html') as step\n        FROM gitlab_project_1.snowplow_events\n\",\"steps\": [\"page_urlpath = '/page1_v2.html'\",\"page_urlpath = '/page2_v2.html'\",\"page_urlpath = '/page3_v2.html'\"]}]",
      "state": "updated"
    },
    {
      "name": "completed_purchase_deprecated",
      "state": "deleted"
    }
  ]
}