<?xml version="1.0" encoding="UTF-8" standalone="no"?>
<!-- Created with Inkscape (http://www.inkscape.org/) -->

<svg
   width="607.4718mm"
   height="303.34778mm"
   viewBox="0 0 607.4718 303.34778"
   version="1.1"
   id="svg5"
   sodipodi:docname="git_concepts.svg"
   inkscape:version="1.1.2 (b8e25be833, 2022-02-05)"
   inkscape:export-filename="/home/m00am/repos/rds_presentations/GitLab/git_concepts.png"
   inkscape:export-xdpi="300"
   inkscape:export-ydpi="300"
   xmlns:inkscape="http://www.inkscape.org/namespaces/inkscape"
   xmlns:sodipodi="http://sodipodi.sourceforge.net/DTD/sodipodi-0.dtd"
   xmlns="http://www.w3.org/2000/svg"
   xmlns:svg="http://www.w3.org/2000/svg">
  <sodipodi:namedview
     id="namedview7"
     pagecolor="#ffffff"
     bordercolor="#666666"
     borderopacity="1.0"
     inkscape:pageshadow="2"
     inkscape:pageopacity="0.0"
     inkscape:pagecheckerboard="0"
     inkscape:document-units="mm"
     showgrid="false"
     inkscape:zoom="0.1767767"
     inkscape:cx="1055.0033"
     inkscape:cy="1663.1151"
     inkscape:window-width="1920"
     inkscape:window-height="1019"
     inkscape:window-x="0"
     inkscape:window-y="0"
     inkscape:window-maximized="1"
     inkscape:current-layer="layer1"
     showguides="true"
     inkscape:guide-bbox="true"
     fit-margin-top="2"
     lock-margins="true"
     fit-margin-left="2"
     fit-margin-right="2"
     fit-margin-bottom="2">
    <sodipodi:guide
       position="481.38397,28.902205"
       orientation="0,-1"
       id="guide125212" />
    <sodipodi:guide
       position="311.77724,177.03041"
       orientation="1,0"
       id="guide147248" />
  </sodipodi:namedview>
  <defs
     id="defs2">
    <marker
       style="overflow:visible"
       id="marker99063"
       refX="0"
       refY="0"
       orient="auto"
       inkscape:stockid="Arrow2Mend"
       inkscape:isstock="true">
      <path
         transform="scale(-0.6)"
         d="M 8.7185878,4.0337352 -2.2072895,0.01601326 8.7185884,-4.0017078 c -1.7454984,2.3720609 -1.7354408,5.6174519 -6e-7,8.035443 z"
         style="fill:context-stroke;fill-rule:evenodd;stroke:context-stroke;stroke-width:0.625;stroke-linejoin:round"
         id="path99061" />
    </marker>
    <marker
       style="overflow:visible"
       id="marker99053"
       refX="0"
       refY="0"
       orient="auto"
       inkscape:stockid="Arrow2Mend"
       inkscape:isstock="true">
      <path
         transform="scale(-0.6)"
         d="M 8.7185878,4.0337352 -2.2072895,0.01601326 8.7185884,-4.0017078 c -1.7454984,2.3720609 -1.7354408,5.6174519 -6e-7,8.035443 z"
         style="fill:context-stroke;fill-rule:evenodd;stroke:context-stroke;stroke-width:0.625;stroke-linejoin:round"
         id="path99051" />
    </marker>
    <marker
       style="overflow:visible"
       id="Arrow2Send"
       refX="0"
       refY="0"
       orient="auto"
       inkscape:stockid="Arrow2Send"
       inkscape:isstock="true">
      <path
         transform="matrix(-0.3,0,0,-0.3,0.69,0)"
         d="M 8.7185878,4.0337352 -2.2072895,0.01601326 8.7185884,-4.0017078 c -1.7454984,2.3720609 -1.7354408,5.6174519 -6e-7,8.035443 z"
         style="fill:context-stroke;fill-rule:evenodd;stroke:context-stroke;stroke-width:0.625;stroke-linejoin:round"
         id="path98808" />
    </marker>
    <marker
       style="overflow:visible"
       id="Arrow2Mend"
       refX="0"
       refY="0"
       orient="auto"
       inkscape:stockid="Arrow2Mend"
       inkscape:isstock="true">
      <path
         transform="scale(-0.6)"
         d="M 8.7185878,4.0337352 -2.2072895,0.01601326 8.7185884,-4.0017078 c -1.7454984,2.3720609 -1.7354408,5.6174519 -6e-7,8.035443 z"
         style="fill:context-stroke;fill-rule:evenodd;stroke:context-stroke;stroke-width:0.625;stroke-linejoin:round"
         id="path98802" />
    </marker>
    <rect
       x="4.7842102"
       y="699.02936"
       width="176.66702"
       height="81.474564"
       id="rect43260" />
    <rect
       x="2.0378909"
       y="710.65393"
       width="198.62334"
       height="184.36874"
       id="rect15291" />
    <inkscape:path-effect
       effect="bspline"
       id="path-effect157130"
       is_visible="true"
       lpeversion="1"
       weight="33.333333"
       steps="2"
       helper_size="0"
       apply_no_weight="true"
       apply_with_weight="true"
       only_selected="false" />
    <inkscape:path-effect
       effect="bspline"
       id="path-effect64914"
       is_visible="true"
       lpeversion="1"
       weight="33.333333"
       steps="2"
       helper_size="0"
       apply_no_weight="true"
       apply_with_weight="true"
       only_selected="false" />
    <rect
       x="4.7842102"
       y="699.02936"
       width="176.66702"
       height="81.474564"
       id="rect43260-5" />
    <rect
       x="4.7842102"
       y="699.02936"
       width="176.66702"
       height="81.474564"
       id="rect43260-2" />
    <rect
       x="4.7842102"
       y="699.02936"
       width="176.66702"
       height="81.474564"
       id="rect43260-2-7" />
    <inkscape:path-effect
       effect="bspline"
       id="path-effect64914-1"
       is_visible="true"
       lpeversion="1"
       weight="33.333333"
       steps="2"
       helper_size="0"
       apply_no_weight="true"
       apply_with_weight="true"
       only_selected="false" />
    <inkscape:path-effect
       effect="bspline"
       id="path-effect64914-1-7"
       is_visible="true"
       lpeversion="1"
       weight="33.333333"
       steps="2"
       helper_size="0"
       apply_no_weight="true"
       apply_with_weight="true"
       only_selected="false" />
    <inkscape:path-effect
       effect="bspline"
       id="path-effect64914-1-7-3"
       is_visible="true"
       lpeversion="1"
       weight="33.333333"
       steps="2"
       helper_size="0"
       apply_no_weight="true"
       apply_with_weight="true"
       only_selected="false" />
    <marker
       style="overflow:visible"
       id="Arrow2Send-6"
       refX="0"
       refY="0"
       orient="auto"
       inkscape:stockid="Arrow2Send"
       inkscape:isstock="true">
      <path
         transform="matrix(-0.3,0,0,-0.3,0.69,0)"
         d="M 8.7185878,4.0337352 -2.2072895,0.01601326 8.7185884,-4.0017078 c -1.7454984,2.3720609 -1.7354408,5.6174519 -6e-7,8.035443 z"
         style="fill:context-stroke;fill-rule:evenodd;stroke:context-stroke;stroke-width:0.625;stroke-linejoin:round"
         id="path98808-1" />
    </marker>
    <inkscape:path-effect
       effect="bspline"
       id="path-effect64914-1-7-3-5"
       is_visible="true"
       lpeversion="1"
       weight="33.333333"
       steps="2"
       helper_size="0"
       apply_no_weight="true"
       apply_with_weight="true"
       only_selected="false" />
    <marker
       style="overflow:visible"
       id="Arrow2Send-6-7"
       refX="0"
       refY="0"
       orient="auto"
       inkscape:stockid="Arrow2Send"
       inkscape:isstock="true">
      <path
         transform="matrix(-0.3,0,0,-0.3,0.69,0)"
         d="M 8.7185878,4.0337352 -2.2072895,0.01601326 8.7185884,-4.0017078 c -1.7454984,2.3720609 -1.7354408,5.6174519 -6e-7,8.035443 z"
         style="fill:context-stroke;fill-rule:evenodd;stroke:context-stroke;stroke-width:0.625;stroke-linejoin:round"
         id="path98808-1-1" />
    </marker>
    <inkscape:path-effect
       effect="bspline"
       id="path-effect64914-1-7-3-5-1"
       is_visible="true"
       lpeversion="1"
       weight="33.333333"
       steps="2"
       helper_size="0"
       apply_no_weight="true"
       apply_with_weight="true"
       only_selected="false" />
    <marker
       style="overflow:visible"
       id="Arrow2Send-6-7-7"
       refX="0"
       refY="0"
       orient="auto"
       inkscape:stockid="Arrow2Send"
       inkscape:isstock="true">
      <path
         transform="matrix(-0.3,0,0,-0.3,0.69,0)"
         d="M 8.7185878,4.0337352 -2.2072895,0.01601326 8.7185884,-4.0017078 c -1.7454984,2.3720609 -1.7354408,5.6174519 -6e-7,8.035443 z"
         style="fill:context-stroke;fill-rule:evenodd;stroke:context-stroke;stroke-width:0.625;stroke-linejoin:round"
         id="path98808-1-1-6" />
    </marker>
    <inkscape:path-effect
       effect="bspline"
       id="path-effect64914-1-7-3-5-1-7"
       is_visible="true"
       lpeversion="1"
       weight="33.333333"
       steps="2"
       helper_size="0"
       apply_no_weight="true"
       apply_with_weight="true"
       only_selected="false" />
    <marker
       style="overflow:visible"
       id="Arrow2Send-6-7-7-6"
       refX="0"
       refY="0"
       orient="auto"
       inkscape:stockid="Arrow2Send"
       inkscape:isstock="true">
      <path
         transform="matrix(-0.3,0,0,-0.3,0.69,0)"
         d="M 8.7185878,4.0337352 -2.2072895,0.01601326 8.7185884,-4.0017078 c -1.7454984,2.3720609 -1.7354408,5.6174519 -6e-7,8.035443 z"
         style="fill:context-stroke;fill-rule:evenodd;stroke:context-stroke;stroke-width:0.625;stroke-linejoin:round"
         id="path98808-1-1-6-5" />
    </marker>
    <inkscape:path-effect
       effect="bspline"
       id="path-effect64914-1-7-3-5-1-7-6"
       is_visible="true"
       lpeversion="1"
       weight="33.333333"
       steps="2"
       helper_size="0"
       apply_no_weight="true"
       apply_with_weight="true"
       only_selected="false" />
    <marker
       style="overflow:visible"
       id="Arrow2Send-6-7-7-6-5"
       refX="0"
       refY="0"
       orient="auto"
       inkscape:stockid="Arrow2Send"
       inkscape:isstock="true">
      <path
         transform="matrix(-0.3,0,0,-0.3,0.69,0)"
         d="M 8.7185878,4.0337352 -2.2072895,0.01601326 8.7185884,-4.0017078 c -1.7454984,2.3720609 -1.7354408,5.6174519 -6e-7,8.035443 z"
         style="fill:context-stroke;fill-rule:evenodd;stroke:context-stroke;stroke-width:0.625;stroke-linejoin:round"
         id="path98808-1-1-6-5-6" />
    </marker>
    <inkscape:path-effect
       effect="bspline"
       id="path-effect64914-1-7-3-5-1-7-6-1"
       is_visible="true"
       lpeversion="1"
       weight="33.333333"
       steps="2"
       helper_size="0"
       apply_no_weight="true"
       apply_with_weight="true"
       only_selected="false" />
    <marker
       style="overflow:visible"
       id="Arrow2Send-6-7-7-1"
       refX="0"
       refY="0"
       orient="auto"
       inkscape:stockid="Arrow2Send"
       inkscape:isstock="true">
      <path
         transform="matrix(-0.3,0,0,-0.3,0.69,0)"
         d="M 8.7185878,4.0337352 -2.2072895,0.01601326 8.7185884,-4.0017078 c -1.7454984,2.3720609 -1.7354408,5.6174519 -6e-7,8.035443 z"
         style="fill:context-stroke;fill-rule:evenodd;stroke:context-stroke;stroke-width:0.625;stroke-linejoin:round"
         id="path98808-1-1-6-59" />
    </marker>
    <inkscape:path-effect
       effect="bspline"
       id="path-effect64914-1-7-3-5-1-7-8"
       is_visible="true"
       lpeversion="1"
       weight="33.333333"
       steps="2"
       helper_size="0"
       apply_no_weight="true"
       apply_with_weight="true"
       only_selected="false" />
  </defs>
  <g
     inkscape:label="Layer 1"
     inkscape:groupmode="layer"
     id="layer1"
     transform="translate(151.35955,19.256632)">
    <path
       style="fill:none;stroke:#666666;stroke-width:1;stroke-linecap:butt;stroke-linejoin:miter;stroke-miterlimit:4;stroke-dasharray:8, 8;stroke-dashoffset:0;stroke-opacity:0.976471"
       d="M -149.35955,79.189304 H 437.21018"
       id="path120391"
       sodipodi:nodetypes="cc" />
    <text
       xml:space="preserve"
       style="font-size:14.1111px;line-height:1.25;font-family:'Noto Sans';-inkscape-font-specification:'Noto Sans, Normal';display:inline;fill:#ec7206;fill-opacity:1;stroke-width:0.264583"
       x="-234.18994"
       y="-103.46213"
       id="text9787-2-6-5-6-7-4-6-9-6-06-43-0-6-4"
       transform="rotate(-90)"><tspan
         sodipodi:role="line"
         id="tspan9785-0-1-8-2-2-0-2-9-1-6-7-4-8-3"
         style="font-style:normal;font-variant:normal;font-weight:bold;font-stretch:normal;font-size:14.1111px;font-family:'Noto Sans';-inkscape-font-specification:'Noto Sans Bold';fill:#ec7206;fill-opacity:1;stroke-width:0.264583"
         x="-234.18994"
         y="-103.46213">Our Computer</tspan></text>
    <g
       id="g47629"
       transform="translate(-83.451491,44.283049)">
      <path
         id="rect1349"
         style="opacity:1;fill:#fff3e9;stroke:#ec7206;stroke-width:2;paint-order:markers fill stroke;stop-color:#000000;stop-opacity:1"
         d="M -4.1324716,179.584 H 53.091619 v 57.22409 H -4.1324716 Z" />
      <text
         xml:space="preserve"
         transform="matrix(0.26458333,0,0,0.26458333,-0.58569046,12.000853)"
         id="text43258"
         style="font-size:33.3333px;line-height:1.25;font-family:'Noto Sans';-inkscape-font-specification:'Noto Sans, Normal';text-align:center;white-space:pre;shape-inside:url(#rect43260)"
         x="57.359955"
         y="0"><tspan
           x="27.235035"
           y="729.35844"
           id="tspan149765">Working </tspan><tspan
           x="21.218405"
           y="771.02507"
           id="tspan149767">Directory</tspan></text>
    </g>
    <g
       id="g47629-3"
       transform="translate(-83.451491,-24.883595)">
      <path
         id="rect1349-5"
         style="opacity:1;fill:#fff3e9;stroke:#ec7206;stroke-width:2;paint-order:markers fill stroke;stop-color:#000000;stop-opacity:1"
         d="M -4.1324716,179.584 H 53.091619 v 57.22409 H -4.1324716 Z" />
      <text
         xml:space="preserve"
         transform="matrix(0.26458333,0,0,0.26458333,-0.00801117,12.000853)"
         id="text43258-6"
         style="font-size:33.3333px;line-height:1.25;font-family:'Noto Sans';-inkscape-font-specification:'Noto Sans, Normal';text-align:center;white-space:pre;shape-inside:url(#rect43260-5)"
         x="57.359955"
         y="0"><tspan
           x="33.501655"
           y="729.35844"
           id="tspan149769">Staging
</tspan><tspan
           x="57.168269"
           y="771.02507"
           id="tspan149771">Area</tspan></text>
    </g>
    <g
       id="g47629-9"
       transform="translate(-83.451491,-94.050239)">
      <path
         id="rect1349-1"
         style="opacity:1;fill:#fff3e9;stroke:#ec7206;stroke-width:2;paint-order:markers fill stroke;stop-color:#000000;stop-opacity:1"
         d="M -4.1324716,179.584 H 53.091619 v 57.22409 H -4.1324716 Z" />
      <text
         xml:space="preserve"
         transform="matrix(0.26458333,0,0,0.26458333,-0.58568978,12.000866)"
         id="text43258-2"
         style="font-size:33.3333px;line-height:1.25;font-family:'Noto Sans';-inkscape-font-specification:'Noto Sans, Normal';text-align:center;white-space:pre;shape-inside:url(#rect43260-2)"
         x="57.359955"
         y="0"><tspan
           x="52.651608"
           y="729.35844"
           id="tspan149773">Local </tspan><tspan
           x="9.2517432"
           y="771.02507"
           id="tspan149775">Repository</tspan></text>
    </g>
    <g
       id="g50659"
       transform="translate(-107.65525)">
      <path
         id="rect1349-1-9"
         style="font-variation-settings:normal;opacity:1;fill:#dfe4f2;fill-opacity:1;stroke:#1a171b;stroke-width:2;stroke-linecap:butt;stroke-linejoin:miter;stroke-miterlimit:4;stroke-dasharray:none;stroke-dashoffset:0;stroke-opacity:1;paint-order:markers fill stroke;stop-color:#000000;stop-opacity:1"
         d="M 20.071287,16.36712 H 77.295378 V 73.59121 H 20.071287 Z" />
      <text
         xml:space="preserve"
         transform="matrix(0.26458333,0,0,0.26458333,23.618069,-151.21601)"
         id="text43258-2-3"
         style="font-size:33.3333px;line-height:1.25;font-family:'Noto Sans';-inkscape-font-specification:'Noto Sans, Normal';text-align:center;white-space:pre;shape-inside:url(#rect43260-2-7)"
         x="57.359955"
         y="0"><tspan
           x="32.268301"
           y="729.35844"
           id="tspan149777">Remote </tspan><tspan
           x="9.2517432"
           y="771.02507"
           id="tspan149779">Repository</tspan></text>
    </g>
    <text
       xml:space="preserve"
       style="font-style:normal;font-variant:normal;font-weight:bold;font-stretch:normal;font-size:14.1111px;line-height:1.25;font-family:'Noto Sans';-inkscape-font-specification:'Noto Sans Bold';font-variant-ligatures:normal;font-variant-position:normal;font-variant-caps:normal;font-variant-numeric:normal;font-variant-alternates:normal;font-variant-east-asian:normal;font-feature-settings:normal;font-variation-settings:normal;text-indent:0;text-align:center;text-decoration-line:none;text-decoration-style:solid;text-decoration-color:#000000;letter-spacing:normal;word-spacing:normal;text-transform:none;writing-mode:lr-tb;direction:ltr;text-orientation:mixed;dominant-baseline:auto;baseline-shift:baseline;text-anchor:middle;white-space:normal;display:inline;opacity:1;vector-effect:none;fill:#1a171b;fill-opacity:1;stroke-width:0.264583;stroke-linecap:butt;stroke-linejoin:miter;stroke-miterlimit:4;stroke-dasharray:none;stroke-dashoffset:0;stroke-opacity:1;-inkscape-stroke:none;stop-color:#000000;stop-opacity:1"
       x="-44.894512"
       y="-117.85545"
       id="text9787-2-6-5-6-7-4-6-9-6-06-4-1-1-5-1-0"
       transform="rotate(-90)"><tspan
         sodipodi:role="line"
         id="tspan9785-0-1-8-2-2-0-2-9-1-6-6-3-1-2-4-62"
         style="font-style:normal;font-variant:normal;font-weight:bold;font-stretch:normal;font-size:14.1111px;line-height:1.25;font-family:'Noto Sans';-inkscape-font-specification:'Noto Sans Bold';font-variant-ligatures:normal;font-variant-position:normal;font-variant-caps:normal;font-variant-numeric:normal;font-variant-alternates:normal;font-variant-east-asian:normal;font-feature-settings:normal;font-variation-settings:normal;text-indent:0;text-align:center;text-decoration-line:none;text-decoration-style:solid;text-decoration-color:#000000;letter-spacing:normal;word-spacing:normal;text-transform:none;writing-mode:lr-tb;direction:ltr;text-orientation:mixed;dominant-baseline:auto;baseline-shift:baseline;text-anchor:middle;white-space:normal;vector-effect:none;fill:#1a171b;fill-opacity:1;stroke-width:0.264583;stroke-linecap:butt;stroke-linejoin:miter;stroke-miterlimit:4;stroke-dasharray:none;stroke-dashoffset:0;stroke-opacity:1;-inkscape-stroke:none;stop-color:#000000;stop-opacity:1"
         x="-44.894512"
         y="-117.85545">The git</tspan><tspan
         sodipodi:role="line"
         style="font-style:normal;font-variant:normal;font-weight:bold;font-stretch:normal;font-size:14.1111px;line-height:1.25;font-family:'Noto Sans';-inkscape-font-specification:'Noto Sans Bold';font-variant-ligatures:normal;font-variant-position:normal;font-variant-caps:normal;font-variant-numeric:normal;font-variant-alternates:normal;font-variant-east-asian:normal;font-feature-settings:normal;font-variation-settings:normal;text-indent:0;text-align:center;text-decoration-line:none;text-decoration-style:solid;text-decoration-color:#000000;letter-spacing:normal;word-spacing:normal;text-transform:none;writing-mode:lr-tb;direction:ltr;text-orientation:mixed;dominant-baseline:auto;baseline-shift:baseline;text-anchor:middle;white-space:normal;vector-effect:none;fill:#1a171b;fill-opacity:1;stroke-width:0.264583;stroke-linecap:butt;stroke-linejoin:miter;stroke-miterlimit:4;stroke-dasharray:none;stroke-dashoffset:0;stroke-opacity:1;-inkscape-stroke:none;stop-color:#000000;stop-opacity:1"
         x="-44.894512"
         y="-100.21658"
         id="tspan61586">Server</tspan></text>
    <g
       id="g65682"
       transform="matrix(0.48169515,0,0,0.48169515,16.057975,132.13741)">
      <path
         style="fill:#f9f9f9;stroke:#666666;stroke-width:2.076;stroke-linecap:butt;stroke-linejoin:miter;stroke-miterlimit:4;stroke-dasharray:none;stroke-dashoffset:0;stroke-opacity:1"
         d="m 2.73422,225.2045 h 45.9028 l 7.3746,8.56243 v 52.15481 H 2.73422 Z"
         id="rect7538-0-8-2-7-9-2-9-6-7-1-6-0-27-4-6-5-2-8-4-4-1-1-9"
         inkscape:connector-curvature="0"
         sodipodi:nodetypes="cccccc" />
      <path
         style="fill:none;stroke:#666666;stroke-width:2.076;stroke-linecap:butt;stroke-linejoin:miter;stroke-miterlimit:4;stroke-dasharray:none;stroke-opacity:1"
         d="m 48.66882,225.24677 v 8.36706 h 7.2318"
         id="path7541-3-8-4-0-8-6-2-5-3-2-0-7-36-5-2-5-6-8-8-0-37-5-2"
         inkscape:connector-curvature="0"
         sodipodi:nodetypes="ccc" />
    </g>
    <text
       xml:space="preserve"
       style="font-style:normal;font-variant:normal;font-weight:normal;font-stretch:normal;font-size:5.92667px;line-height:1.25;font-family:'Noto Mono';-inkscape-font-specification:'Noto Mono';fill:#61a27c;fill-opacity:1;stroke-width:0.221183"
       x="18.475471"
       y="264.79477"
       id="text4384-3-7-49-5-9-0-6-8-6-3-1-2"><tspan
         sodipodi:role="line"
         id="tspan4382-6-4-09-6-7-3-0-6-3-1-0-0"
         style="font-style:normal;font-variant:normal;font-weight:normal;font-stretch:normal;font-size:5.92667px;font-family:'Noto Mono';-inkscape-font-specification:'Noto Mono';fill:#61a27c;fill-opacity:1;stroke-width:0.221183"
         x="18.475471"
         y="264.79477">+</tspan></text>
    <path
       style="fill:#666666;fill-opacity:0.996078;stroke:#666666;stroke-width:1.5;stroke-linecap:butt;stroke-linejoin:miter;stroke-miterlimit:4;stroke-dasharray:none;stroke-opacity:0.913725"
       d="M 22.128746,248.21502 H 40.545957"
       id="path65816"
       sodipodi:nodetypes="cc" />
    <path
       style="fill:#666666;fill-opacity:0.996078;stroke:#666666;stroke-width:1.5;stroke-linecap:butt;stroke-linejoin:miter;stroke-miterlimit:4;stroke-dasharray:none;stroke-opacity:0.913725"
       d="M 22.128746,251.83616 H 40.545957"
       id="path65816-7"
       sodipodi:nodetypes="cc" />
    <path
       style="fill:none;stroke:#b8103b;stroke-width:1.5;stroke-linecap:butt;stroke-linejoin:miter;stroke-miterlimit:4;stroke-dasharray:none;stroke-opacity:1"
       d="M 22.128746,255.45731 H 40.545957"
       id="path65816-8"
       sodipodi:nodetypes="cc" />
    <path
       style="fill:none;stroke:#61a27c;stroke-width:1.5;stroke-linecap:butt;stroke-linejoin:miter;stroke-miterlimit:4;stroke-dasharray:none;stroke-opacity:0.976471"
       d="M 22.128746,259.07845 H 40.545957"
       id="path65816-4"
       sodipodi:nodetypes="cc" />
    <path
       style="fill:none;stroke:#61a27c;stroke-width:1.5;stroke-linecap:butt;stroke-linejoin:miter;stroke-miterlimit:4;stroke-dasharray:none;stroke-opacity:0.976471"
       d="M 22.128746,262.6996 H 40.545957"
       id="path65816-5"
       sodipodi:nodetypes="cc" />
    <path
       style="fill:#666666;fill-opacity:0.996078;stroke:#666666;stroke-width:1.5;stroke-linecap:butt;stroke-linejoin:miter;stroke-miterlimit:4;stroke-dasharray:none;stroke-opacity:0.913725"
       d="M 22.128746,266.32074 H 40.545957"
       id="path65816-0"
       sodipodi:nodetypes="cc" />
    <text
       xml:space="preserve"
       style="font-style:normal;font-variant:normal;font-weight:normal;font-stretch:normal;font-size:5.92667px;line-height:1.25;font-family:'Noto Mono';-inkscape-font-specification:'Noto Mono';fill:#b8103b;fill-opacity:1;stroke-width:0.221183"
       x="18.473783"
       y="257.04605"
       id="text9886-3-5-7-9-4-9-37-6-2-3"><tspan
         sodipodi:role="line"
         id="tspan9884-5-4-1-8-0-9-8-3-9-6"
         style="font-style:normal;font-variant:normal;font-weight:normal;font-stretch:normal;font-size:5.92667px;font-family:'Noto Mono';-inkscape-font-specification:'Noto Mono';fill:#b8103b;fill-opacity:1;stroke-width:0.221183"
         x="18.473783"
         y="257.04605">-</tspan></text>
    <text
       xml:space="preserve"
       style="font-style:normal;font-variant:normal;font-weight:normal;font-stretch:normal;font-size:5.92667px;line-height:1.25;font-family:'Noto Mono';-inkscape-font-specification:'Noto Mono';fill:#61a27c;fill-opacity:1;stroke-width:0.221183"
       x="18.475471"
       y="261.17361"
       id="text4384-3-7-49-5-9-0-6-8-6-3-1"><tspan
         sodipodi:role="line"
         id="tspan4382-6-4-09-6-7-3-0-6-3-1-0"
         style="font-style:normal;font-variant:normal;font-weight:normal;font-stretch:normal;font-size:5.92667px;font-family:'Noto Mono';-inkscape-font-specification:'Noto Mono';fill:#61a27c;fill-opacity:1;stroke-width:0.221183"
         x="18.475471"
         y="261.17361">+</tspan></text>
    <rect
       style="font-variation-settings:normal;fill:#eef8fa;fill-opacity:1;stroke:#5fbcd3;stroke-width:1.5;stroke-linecap:butt;stroke-linejoin:miter;stroke-miterlimit:4;stroke-dasharray:3, 1.5;stroke-dashoffset:0;stroke-opacity:1;paint-order:markers fill stroke;stop-color:#000000"
       id="rect72335-9-9-0-6-0-4-6"
       width="27.111118"
       height="27.111118"
       x="70.44117"
       y="169.7569"
       ry="3.9541323" />
    <path
       style="fill:#000000;fill-opacity:0;stroke:#ec7206;stroke-width:2;stroke-linecap:butt;stroke-linejoin:miter;stroke-miterlimit:4;stroke-dasharray:none;stroke-opacity:1;marker-end:url(#Arrow2Send)"
       d="m 29.762324,233.63981 c -0.176386,-16.87842 -0.35277,-33.75668 5.386742,-42.19635 5.739513,-8.43968 17.394112,-8.43968 29.048725,-8.43968"
       id="path248379-5-7-5-5"
       inkscape:path-effect="#path-effect64914-1-7"
       inkscape:original-d="m 29.762324,233.63981 c -0.176124,-16.87842 -0.352509,-33.75668 -0.529166,-50.63603 11.655421,2.6e-4 23.31002,2.6e-4 34.964633,0"
       sodipodi:nodetypes="ccc" />
    <path
       style="fill:#000000;fill-opacity:0;stroke:#ec7206;stroke-width:2;stroke-linecap:butt;stroke-linejoin:miter;stroke-miterlimit:4;stroke-dasharray:none;stroke-opacity:1;marker-end:url(#Arrow2Send)"
       d="m 85.571371,164.7603 c -0.176386,-16.87842 -0.35277,-33.75668 5.386743,-42.19635 5.739514,-8.43968 17.394116,-8.43968 29.048726,-8.43968"
       id="path248379-5-7-5-5-7"
       inkscape:path-effect="#path-effect64914-1-7-3"
       inkscape:original-d="m 85.571371,164.7603 c -0.176124,-16.87842 -0.352509,-33.75668 -0.529166,-50.63603 11.655423,2.6e-4 23.310025,2.6e-4 34.964635,0"
       sodipodi:nodetypes="ccc" />
    <g
       id="g147095">
      <rect
         style="font-variation-settings:normal;fill:#eef8fa;fill-opacity:1;stroke:#5fbcd3;stroke-width:1.5;stroke-linecap:butt;stroke-linejoin:miter;stroke-miterlimit:4;stroke-dasharray:none;stroke-dashoffset:0;stroke-opacity:1;paint-order:markers fill stroke;stop-color:#000000"
         id="rect72335-9-9-0-6-0-4-6-9"
         width="27.111118"
         height="27.111118"
         x="128.47855"
         y="100.59025"
         ry="3.9541323" />
      <g
         id="g99694">
        <circle
           style="font-variation-settings:normal;fill:#ffffff;fill-opacity:1;stroke:#666666;stroke-width:1.5;stroke-linecap:butt;stroke-linejoin:miter;stroke-miterlimit:4;stroke-dasharray:none;stroke-dashoffset:0;stroke-opacity:1;paint-order:markers fill stroke;stop-color:#000000"
           id="path16943-7-6-6-3-8-5-0-1-5-0"
           cx="142.0341"
           cy="156.27066"
           r="3.5577967" />
        <path
           style="font-variation-settings:normal;fill:none;fill-opacity:1;stroke:#666666;stroke-width:1.5;stroke-linecap:butt;stroke-linejoin:miter;stroke-miterlimit:4;stroke-dasharray:none;stroke-dashoffset:0;stroke-opacity:1;paint-order:markers fill stroke;stop-color:#000000"
           d="m 142.03408,153.19457 v -9.12784"
           id="path17654-5-9-4-6-1-5-4-4"
           sodipodi:nodetypes="cc" />
        <path
           style="font-variation-settings:normal;fill:none;fill-opacity:1;stroke:#5fbcd3;stroke-width:1.5;stroke-linecap:butt;stroke-linejoin:miter;stroke-miterlimit:4;stroke-dasharray:none;stroke-dashoffset:0;stroke-opacity:1;paint-order:markers fill stroke;stop-color:#000000"
           d="m 142.03408,136.68763 v -9.12784"
           id="path17654-5-1-9-6-6-4-9-8"
           sodipodi:nodetypes="cc" />
        <circle
           style="font-variation-settings:normal;fill:#ffffff;fill-opacity:1;stroke:#666666;stroke-width:1.5;stroke-linecap:butt;stroke-linejoin:miter;stroke-miterlimit:4;stroke-dasharray:none;stroke-dashoffset:0;stroke-opacity:1;paint-order:markers fill stroke;stop-color:#000000"
           id="path16943-7-6-6-1-0-7-4-2-5"
           cx="142.0341"
           cy="140.69003"
           r="3.5577967" />
      </g>
    </g>
    <g
       id="g147095-8"
       transform="translate(218.69182,-8.2275409)">
      <rect
         style="font-variation-settings:normal;fill:#eef8fa;fill-opacity:1;stroke:#5fbcd3;stroke-width:1.5;stroke-linecap:butt;stroke-linejoin:miter;stroke-miterlimit:4;stroke-dasharray:none;stroke-dashoffset:0;stroke-opacity:1;paint-order:markers fill stroke;stop-color:#000000"
         id="rect72335-9-9-0-6-0-4-6-9-5"
         width="27.111118"
         height="27.111118"
         x="128.47855"
         y="100.59025"
         ry="3.9541323" />
      <g
         id="g99694-9">
        <circle
           style="font-variation-settings:normal;fill:#ffffff;fill-opacity:1;stroke:#666666;stroke-width:1.5;stroke-linecap:butt;stroke-linejoin:miter;stroke-miterlimit:4;stroke-dasharray:none;stroke-dashoffset:0;stroke-opacity:1;paint-order:markers fill stroke;stop-color:#000000"
           id="path16943-7-6-6-3-8-5-0-1-5-0-75"
           cx="142.0341"
           cy="156.27066"
           r="3.5577967" />
        <path
           style="font-variation-settings:normal;fill:none;fill-opacity:1;stroke:#666666;stroke-width:1.5;stroke-linecap:butt;stroke-linejoin:miter;stroke-miterlimit:4;stroke-dasharray:none;stroke-dashoffset:0;stroke-opacity:1;paint-order:markers fill stroke;stop-color:#000000"
           d="m 142.03408,153.19457 v -9.12784"
           id="path17654-5-9-4-6-1-5-4-4-3"
           sodipodi:nodetypes="cc" />
        <path
           style="font-variation-settings:normal;fill:none;fill-opacity:1;stroke:#5fbcd3;stroke-width:1.5;stroke-linecap:butt;stroke-linejoin:miter;stroke-miterlimit:4;stroke-dasharray:none;stroke-dashoffset:0;stroke-opacity:1;paint-order:markers fill stroke;stop-color:#000000"
           d="m 142.03408,136.68763 v -9.12784"
           id="path17654-5-1-9-6-6-4-9-8-8"
           sodipodi:nodetypes="cc" />
        <circle
           style="font-variation-settings:normal;fill:#ffffff;fill-opacity:1;stroke:#666666;stroke-width:1.5;stroke-linecap:butt;stroke-linejoin:miter;stroke-miterlimit:4;stroke-dasharray:none;stroke-dashoffset:0;stroke-opacity:1;paint-order:markers fill stroke;stop-color:#000000"
           id="path16943-7-6-6-1-0-7-4-2-5-8"
           cx="142.0341"
           cy="140.69003"
           r="3.5577967" />
      </g>
    </g>
    <g
       id="g99769"
       transform="translate(18.591278,12.203888)">
      <rect
         style="font-variation-settings:normal;fill:#eef8fa;fill-opacity:1;stroke:#5fbcd3;stroke-width:1.5;stroke-linecap:butt;stroke-linejoin:miter;stroke-miterlimit:4;stroke-dasharray:none;stroke-dashoffset:0;stroke-opacity:1;paint-order:markers fill stroke;stop-color:#000000"
         id="rect72335-9-9-0-6-0-4-6-9-7"
         width="27.111118"
         height="27.111118"
         x="169.5361"
         y="2.6600621"
         ry="3.9541323" />
      <g
         id="g99694-1"
         transform="translate(41.05756,-97.930186)">
        <circle
           style="font-variation-settings:normal;fill:#ffffff;fill-opacity:1;stroke:#666666;stroke-width:1.5;stroke-linecap:butt;stroke-linejoin:miter;stroke-miterlimit:4;stroke-dasharray:none;stroke-dashoffset:0;stroke-opacity:1;paint-order:markers fill stroke;stop-color:#000000"
           id="path16943-7-6-6-3-8-5-0-1-5-0-7"
           cx="142.0341"
           cy="156.27066"
           r="3.5577967" />
        <path
           style="font-variation-settings:normal;fill:none;fill-opacity:1;stroke:#666666;stroke-width:1.5;stroke-linecap:butt;stroke-linejoin:miter;stroke-miterlimit:4;stroke-dasharray:none;stroke-dashoffset:0;stroke-opacity:1;paint-order:markers fill stroke;stop-color:#000000"
           d="m 142.03408,153.19457 v -9.12784"
           id="path17654-5-9-4-6-1-5-4-4-2"
           sodipodi:nodetypes="cc" />
        <path
           style="font-variation-settings:normal;fill:none;fill-opacity:1;stroke:#5fbcd3;stroke-width:1.5;stroke-linecap:butt;stroke-linejoin:miter;stroke-miterlimit:4;stroke-dasharray:none;stroke-dashoffset:0;stroke-opacity:1;paint-order:markers fill stroke;stop-color:#000000"
           d="m 142.03408,136.68763 v -9.12784"
           id="path17654-5-1-9-6-6-4-9-8-7"
           sodipodi:nodetypes="cc" />
        <circle
           style="font-variation-settings:normal;fill:#ffffff;fill-opacity:1;stroke:#666666;stroke-width:1.5;stroke-linecap:butt;stroke-linejoin:miter;stroke-miterlimit:4;stroke-dasharray:none;stroke-dashoffset:0;stroke-opacity:1;paint-order:markers fill stroke;stop-color:#000000"
           id="path16943-7-6-6-1-0-7-4-2-5-2"
           cx="142.0341"
           cy="140.69003"
           r="3.5577967" />
      </g>
    </g>
    <text
       xml:space="preserve"
       style="font-size:7.05556px;line-height:1.25;font-family:'Noto Sans';-inkscape-font-specification:'Noto Sans, Normal';display:inline;fill:#ec7206;fill-opacity:1;stroke-width:0.264583"
       x="0.93009448"
       y="208.07204"
       id="text9787-2-6-5-6-7-4-6-9-6-0-5-7-2"><tspan
         sodipodi:role="line"
         id="tspan9785-0-1-8-2-2-0-2-9-1-1-8-7-6"
         style="font-style:normal;font-variant:normal;font-weight:bold;font-stretch:normal;font-size:7.05556px;font-family:'Noto Sans';-inkscape-font-specification:'Noto Sans Bold';fill:#ec7206;fill-opacity:1;stroke-width:0.264583"
         x="0.93009448"
         y="208.07204">git add</tspan></text>
    <text
       xml:space="preserve"
       style="font-size:7.05556px;line-height:1.25;font-family:'Noto Sans';-inkscape-font-specification:'Noto Sans, Normal';display:inline;fill:#ec7206;fill-opacity:1;stroke-width:0.264583"
       x="43.089104"
       y="134.70581"
       id="text9787-2-6-5-6-7-4-6-9-6-0-5-7-2-1"><tspan
         sodipodi:role="line"
         id="tspan9785-0-1-8-2-2-0-2-9-1-1-8-7-6-0"
         style="font-style:normal;font-variant:normal;font-weight:bold;font-stretch:normal;font-size:7.05556px;font-family:'Noto Sans';-inkscape-font-specification:'Noto Sans Bold';fill:#ec7206;fill-opacity:1;stroke-width:0.264583"
         x="43.089104"
         y="134.70581">git commit</tspan></text>
    <path
       style="fill:#000000;fill-opacity:0;stroke:#b8103b;stroke-width:2;stroke-linecap:butt;stroke-linejoin:miter;stroke-miterlimit:4;stroke-dasharray:none;stroke-opacity:1;marker-end:url(#Arrow2Send-6)"
       d="m 143.17817,94.915025 c -0.17639,-20.406197 -0.35277,-40.812143 5.38674,-51.015753 5.73952,-10.20361 17.39412,-10.20361 29.04873,-10.20361"
       id="path248379-5-7-5-5-7-9"
       inkscape:path-effect="#path-effect64914-1-7-3-5"
       inkscape:original-d="M 143.17817,94.915025 C 143.00204,74.508826 142.82566,54.10288 142.649,33.695662 c 11.65543,2.64e-4 23.31003,2.64e-4 34.96464,0"
       sodipodi:nodetypes="ccc" />
    <text
       xml:space="preserve"
       style="font-size:7.05556px;line-height:1.25;font-family:'Noto Sans';-inkscape-font-specification:'Noto Sans, Normal';display:inline;fill:#b8103b;fill-opacity:1;stroke-width:0.264583"
       x="111.48468"
       y="55.592922"
       id="text9787-2-6-5-6-7-4-6-9-6-0-5-7-2-1-1"><tspan
         sodipodi:role="line"
         id="tspan9785-0-1-8-2-2-0-2-9-1-1-8-7-6-0-7"
         style="font-style:normal;font-variant:normal;font-weight:bold;font-stretch:normal;font-size:7.05556px;font-family:'Noto Sans';-inkscape-font-specification:'Noto Sans Bold';fill:#b8103b;fill-opacity:1;stroke-width:0.264583"
         x="111.48468"
         y="55.592922">git push</tspan></text>
    <path
       style="fill:#000000;fill-opacity:0;stroke:#656565;stroke-width:2;stroke-linecap:butt;stroke-linejoin:miter;stroke-miterlimit:4;stroke-dasharray:none;stroke-opacity:0.976471;marker-end:url(#Arrow2Send-6-7)"
       d="m 194.85314,82.883061 c 0.17639,8.059295 0.35277,16.118169 -5.38674,20.147929 -5.73952,4.02976 -17.39412,4.02976 -29.04873,4.02976"
       id="path248379-5-7-5-5-7-9-5"
       inkscape:path-effect="#path-effect64914-1-7-3-5-1"
       inkscape:original-d="m 194.85314,82.883061 c 0.17665,8.059289 0.35303,16.118163 0.52917,24.177689 -11.65543,2.7e-4 -23.31003,2.7e-4 -34.96464,0"
       sodipodi:nodetypes="ccc" />
    <text
       xml:space="preserve"
       style="font-size:7.05556px;line-height:1.25;font-family:'Noto Sans';-inkscape-font-specification:'Noto Sans, Normal';display:inline;fill:#656565;fill-opacity:0.976471;stroke-width:0.264583"
       x="158.98541"
       y="95.093422"
       id="text9787-2-6-5-6-7-4-6-9-6-0-5-7-2-1-1-9"><tspan
         sodipodi:role="line"
         id="tspan9785-0-1-8-2-2-0-2-9-1-1-8-7-6-0-7-7"
         style="font-style:normal;font-variant:normal;font-weight:bold;font-stretch:normal;font-size:7.05556px;font-family:'Noto Sans';-inkscape-font-specification:'Noto Sans Bold';fill:#656565;fill-opacity:0.976471;stroke-width:0.264583"
         x="158.98541"
         y="95.093422">git fetch</tspan></text>
    <path
       style="fill:#000000;fill-opacity:0;stroke:#b8103b;stroke-width:2;stroke-linecap:butt;stroke-linejoin:miter;stroke-miterlimit:4;stroke-dasharray:none;stroke-opacity:1;marker-end:url(#Arrow2Send-6-7-7)"
       d="m 207.23816,83.060897 c 0.12781,41.608193 0.25561,83.215673 0.34381,111.940163 0.0882,28.72449 0.13678,44.5641 -7.73075,52.48415 -7.86753,7.92005 -23.65079,7.92005 -39.43355,7.92005"
       id="path248379-5-7-5-5-7-9-5-3"
       inkscape:path-effect="#path-effect64914-1-7-3-5-1-7"
       inkscape:original-d="m 207.23816,83.060897 c 0.12807,41.608193 0.25575,83.215673 0.38342,124.825353 0.0486,15.8393 0.0974,31.67891 0.14575,47.51901 -15.78364,2.6e-4 -31.5669,2.6e-4 -47.34966,0"
       sodipodi:nodetypes="cccc" />
    <path
       style="fill:#000000;fill-opacity:0;stroke:#b8103b;stroke-width:2;stroke-linecap:butt;stroke-linejoin:miter;stroke-miterlimit:4;stroke-dasharray:none;stroke-opacity:1;marker-end:url(#Arrow2Send-6-7-7-6)"
       d="m 207.23816,83.060895 c 0.17639,13.350898 0.35278,26.701485 -7.45085,33.377095 -7.80362,6.6756 -23.58688,6.6756 -39.36964,6.6756"
       id="path248379-5-7-5-5-7-9-5-3-3"
       inkscape:path-effect="#path-effect64914-1-7-3-5-1-7-6"
       inkscape:original-d="m 207.23816,83.060895 c 0,0 0.35304,26.701485 0.52917,40.052695 -15.78364,2.6e-4 -31.5669,2.6e-4 -47.34966,0"
       sodipodi:nodetypes="ccc" />
    <text
       xml:space="preserve"
       style="font-size:7.05556px;line-height:1.25;font-family:'Noto Sans';-inkscape-font-specification:'Noto Sans, Normal';display:inline;fill:#b8103b;fill-opacity:1;stroke-width:0.264583"
       x="176.81506"
       y="142.62836"
       id="text9787-2-6-5-6-7-4-6-9-6-0-5-7-2-1-1-9-9"><tspan
         sodipodi:role="line"
         id="tspan9785-0-1-8-2-2-0-2-9-1-1-8-7-6-0-7-7-4"
         style="font-style:normal;font-variant:normal;font-weight:bold;font-stretch:normal;font-size:7.05556px;font-family:'Noto Sans';-inkscape-font-specification:'Noto Sans Bold';fill:#b8103b;fill-opacity:1;stroke-width:0.264583"
         x="176.81506"
         y="142.62836">git pull</tspan></text>
    <g
       id="g133333"
       transform="translate(-8.7783878,-1.40491)">
      <g
         id="g65682-8"
         transform="matrix(0.48169515,0,0,0.48169515,136.6637,133.54232)">
        <path
           style="fill:#f9f9f9;stroke:#666666;stroke-width:2.076;stroke-linecap:butt;stroke-linejoin:miter;stroke-miterlimit:4;stroke-dasharray:none;stroke-dashoffset:0;stroke-opacity:1"
           d="m 2.73422,225.2045 h 45.9028 l 7.3746,8.56243 v 52.15481 H 2.73422 Z"
           id="rect7538-0-8-2-7-9-2-9-6-7-1-6-0-27-4-6-5-2-8-4-4-1-1-9-1"
           inkscape:connector-curvature="0"
           sodipodi:nodetypes="cccccc" />
        <path
           style="fill:none;stroke:#666666;stroke-width:2.076;stroke-linecap:butt;stroke-linejoin:miter;stroke-miterlimit:4;stroke-dasharray:none;stroke-opacity:1"
           d="m 48.66882,225.24677 v 8.36706 h 7.2318"
           id="path7541-3-8-4-0-8-6-2-5-3-2-0-7-36-5-2-5-6-8-8-0-37-5-2-2"
           inkscape:connector-curvature="0"
           sodipodi:nodetypes="ccc" />
      </g>
      <path
         style="fill:#666666;fill-opacity:0.996078;stroke:#666666;stroke-width:1.5;stroke-linecap:butt;stroke-linejoin:miter;stroke-miterlimit:4;stroke-dasharray:none;stroke-opacity:0.913725"
         d="m 142.73448,249.61993 h 18.41721"
         id="path65816-9"
         sodipodi:nodetypes="cc" />
      <path
         style="fill:#666666;fill-opacity:0.996078;stroke:#666666;stroke-width:1.5;stroke-linecap:butt;stroke-linejoin:miter;stroke-miterlimit:4;stroke-dasharray:none;stroke-opacity:0.913725"
         d="m 142.73448,253.24107 h 18.41721"
         id="path65816-7-0"
         sodipodi:nodetypes="cc" />
      <path
         style="fill:none;stroke:#727272;stroke-width:1.5;stroke-linecap:butt;stroke-linejoin:miter;stroke-miterlimit:4;stroke-dasharray:none;stroke-opacity:1"
         d="m 142.73448,256.86222 h 18.41721"
         id="path65816-8-8"
         sodipodi:nodetypes="cc" />
      <path
         style="fill:none;stroke:#727272;stroke-width:1.5;stroke-linecap:butt;stroke-linejoin:miter;stroke-miterlimit:4;stroke-dasharray:none;stroke-opacity:1"
         d="m 142.73448,260.48336 h 18.41721"
         id="path65816-4-8"
         sodipodi:nodetypes="cc" />
      <path
         style="fill:none;stroke:#727272;stroke-width:1.5;stroke-linecap:butt;stroke-linejoin:miter;stroke-miterlimit:4;stroke-dasharray:none;stroke-opacity:1"
         d="m 142.73448,264.10451 h 18.41721"
         id="path65816-5-5"
         sodipodi:nodetypes="cc" />
      <path
         style="fill:#666666;fill-opacity:0.996078;stroke:#666666;stroke-width:1.5;stroke-linecap:butt;stroke-linejoin:miter;stroke-miterlimit:4;stroke-dasharray:none;stroke-opacity:0.913725"
         d="m 142.73448,267.72565 h 18.41721"
         id="path65816-0-0"
         sodipodi:nodetypes="cc" />
    </g>
    <g
       id="g99769-4"
       transform="translate(233.6105,12.203888)">
      <rect
         style="font-variation-settings:normal;fill:#eef8fa;fill-opacity:1;stroke:#5fbcd3;stroke-width:1.5;stroke-linecap:butt;stroke-linejoin:miter;stroke-miterlimit:4;stroke-dasharray:none;stroke-dashoffset:0;stroke-opacity:1;paint-order:markers fill stroke;stop-color:#000000"
         id="rect72335-9-9-0-6-0-4-6-9-7-8"
         width="27.111118"
         height="27.111118"
         x="169.5361"
         y="2.6600621"
         ry="3.9541323" />
      <g
         id="g99694-1-1"
         transform="translate(41.05756,-97.930186)">
        <circle
           style="font-variation-settings:normal;fill:#ffffff;fill-opacity:1;stroke:#666666;stroke-width:1.5;stroke-linecap:butt;stroke-linejoin:miter;stroke-miterlimit:4;stroke-dasharray:none;stroke-dashoffset:0;stroke-opacity:1;paint-order:markers fill stroke;stop-color:#000000"
           id="path16943-7-6-6-3-8-5-0-1-5-0-7-0"
           cx="142.0341"
           cy="156.27066"
           r="3.5577967" />
        <path
           style="font-variation-settings:normal;fill:none;fill-opacity:1;stroke:#666666;stroke-width:1.5;stroke-linecap:butt;stroke-linejoin:miter;stroke-miterlimit:4;stroke-dasharray:none;stroke-dashoffset:0;stroke-opacity:1;paint-order:markers fill stroke;stop-color:#000000"
           d="m 142.03408,153.19457 v -9.12784"
           id="path17654-5-9-4-6-1-5-4-4-2-3"
           sodipodi:nodetypes="cc" />
        <path
           style="font-variation-settings:normal;fill:none;fill-opacity:1;stroke:#5fbcd3;stroke-width:1.5;stroke-linecap:butt;stroke-linejoin:miter;stroke-miterlimit:4;stroke-dasharray:none;stroke-dashoffset:0;stroke-opacity:1;paint-order:markers fill stroke;stop-color:#000000"
           d="m 142.03408,136.68763 v -9.12784"
           id="path17654-5-1-9-6-6-4-9-8-7-0"
           sodipodi:nodetypes="cc" />
        <circle
           style="font-variation-settings:normal;fill:#ffffff;fill-opacity:1;stroke:#666666;stroke-width:1.5;stroke-linecap:butt;stroke-linejoin:miter;stroke-miterlimit:4;stroke-dasharray:none;stroke-dashoffset:0;stroke-opacity:1;paint-order:markers fill stroke;stop-color:#000000"
           id="path16943-7-6-6-1-0-7-4-2-5-2-4"
           cx="142.0341"
           cy="140.69003"
           r="3.5577967" />
      </g>
    </g>
    <path
       style="fill:#000000;fill-opacity:0;stroke:#b8103b;stroke-width:2;stroke-linecap:butt;stroke-linejoin:miter;stroke-miterlimit:4;stroke-dasharray:none;stroke-opacity:1;marker-end:url(#Arrow2Send-6-7-7-1)"
       d="m 417.15159,83.060901 c 0.12781,41.608189 0.25561,83.215669 0.34381,111.940159 0.0882,28.72449 0.13678,44.5641 -5.66649,52.48415 -5.80327,7.92005 -17.45818,7.92005 -29.11279,7.92005"
       id="path248379-5-7-5-5-7-9-5-3-4"
       inkscape:path-effect="#path-effect64914-1-7-3-5-1-7-8"
       inkscape:original-d="m 417.15159,83.060901 c 0.12807,41.608189 0.25575,83.215669 0.38342,124.825349 0.0486,15.8393 0.0974,31.67891 0.14575,47.51901 -11.65512,2.6e-4 -23.31003,2.6e-4 -34.96464,0"
       sodipodi:nodetypes="cccc" />
    <path
       style="fill:#000000;fill-opacity:0;stroke:#b8103b;stroke-width:2;stroke-linecap:butt;stroke-linejoin:miter;stroke-miterlimit:4;stroke-dasharray:none;stroke-opacity:1;marker-end:url(#Arrow2Send-6-7-7-6-5)"
       d="m 417.15159,83.060891 c 0.17639,13.3509 0.35278,26.701489 -7.41515,33.377099 -7.76792,6.6756 -23.47978,6.6756 -39.19115,6.6756"
       id="path248379-5-7-5-5-7-9-5-3-3-4"
       inkscape:path-effect="#path-effect64914-1-7-3-5-1-7-6-1"
       inkscape:original-d="m 417.15159,83.060891 c 0,0 0.35304,26.701489 0.52917,40.052699 -15.71224,2.6e-4 -31.4241,2.6e-4 -47.13547,0"
       sodipodi:nodetypes="ccc" />
    <text
       xml:space="preserve"
       style="font-size:7.05556px;line-height:1.25;font-family:'Noto Sans';-inkscape-font-specification:'Noto Sans, Normal';display:inline;fill:#b8103b;fill-opacity:1;stroke-width:0.264583"
       x="423.94977"
       y="142.62834"
       id="text9787-2-6-5-6-7-4-6-9-6-0-5-7-2-1-1-9-9-4"><tspan
         sodipodi:role="line"
         id="tspan9785-0-1-8-2-2-0-2-9-1-1-8-7-6-0-7-7-4-7"
         style="font-style:normal;font-variant:normal;font-weight:bold;font-stretch:normal;font-size:7.05556px;font-family:'Noto Sans';-inkscape-font-specification:'Noto Sans Bold';fill:#b8103b;fill-opacity:1;stroke-width:0.264583"
         x="423.94977"
         y="142.62834">git clone</tspan></text>
    <g
       id="g133333-6"
       transform="translate(209.91343,-1.40491)">
      <g
         id="g65682-8-3"
         transform="matrix(0.48169515,0,0,0.48169515,136.6637,133.54232)">
        <path
           style="fill:#f9f9f9;stroke:#666666;stroke-width:2.076;stroke-linecap:butt;stroke-linejoin:miter;stroke-miterlimit:4;stroke-dasharray:none;stroke-dashoffset:0;stroke-opacity:1"
           d="m 2.73422,225.2045 h 45.9028 l 7.3746,8.56243 v 52.15481 H 2.73422 Z"
           id="rect7538-0-8-2-7-9-2-9-6-7-1-6-0-27-4-6-5-2-8-4-4-1-1-9-1-1"
           inkscape:connector-curvature="0"
           sodipodi:nodetypes="cccccc" />
        <path
           style="fill:none;stroke:#666666;stroke-width:2.076;stroke-linecap:butt;stroke-linejoin:miter;stroke-miterlimit:4;stroke-dasharray:none;stroke-opacity:1"
           d="m 48.66882,225.24677 v 8.36706 h 7.2318"
           id="path7541-3-8-4-0-8-6-2-5-3-2-0-7-36-5-2-5-6-8-8-0-37-5-2-2-7"
           inkscape:connector-curvature="0"
           sodipodi:nodetypes="ccc" />
      </g>
      <path
         style="fill:#666666;fill-opacity:0.996078;stroke:#666666;stroke-width:1.5;stroke-linecap:butt;stroke-linejoin:miter;stroke-miterlimit:4;stroke-dasharray:none;stroke-opacity:0.913725"
         d="m 142.73448,249.61993 h 18.41721"
         id="path65816-9-5"
         sodipodi:nodetypes="cc" />
      <path
         style="fill:#666666;fill-opacity:0.996078;stroke:#666666;stroke-width:1.5;stroke-linecap:butt;stroke-linejoin:miter;stroke-miterlimit:4;stroke-dasharray:none;stroke-opacity:0.913725"
         d="m 142.73448,253.24107 h 18.41721"
         id="path65816-7-0-9"
         sodipodi:nodetypes="cc" />
      <path
         style="fill:none;stroke:#727272;stroke-width:1.5;stroke-linecap:butt;stroke-linejoin:miter;stroke-miterlimit:4;stroke-dasharray:none;stroke-opacity:1"
         d="m 142.73448,256.86222 h 18.41721"
         id="path65816-8-8-6"
         sodipodi:nodetypes="cc" />
      <path
         style="fill:none;stroke:#727272;stroke-width:1.5;stroke-linecap:butt;stroke-linejoin:miter;stroke-miterlimit:4;stroke-dasharray:none;stroke-opacity:1"
         d="m 142.73448,260.48336 h 18.41721"
         id="path65816-4-8-2"
         sodipodi:nodetypes="cc" />
      <path
         style="fill:none;stroke:#727272;stroke-width:1.5;stroke-linecap:butt;stroke-linejoin:miter;stroke-miterlimit:4;stroke-dasharray:none;stroke-opacity:1"
         d="m 142.73448,264.10451 h 18.41721"
         id="path65816-5-5-1"
         sodipodi:nodetypes="cc" />
      <path
         style="fill:#666666;fill-opacity:0.996078;stroke:#666666;stroke-width:1.5;stroke-linecap:butt;stroke-linejoin:miter;stroke-miterlimit:4;stroke-dasharray:none;stroke-opacity:0.913725"
         d="m 142.73448,267.72565 h 18.41721"
         id="path65816-0-0-7"
         sodipodi:nodetypes="cc" />
    </g>
    <text
       xml:space="preserve"
       style="font-style:normal;font-variant:normal;font-weight:bold;font-stretch:normal;font-size:10.5833px;line-height:1.25;font-family:'Noto Sans';-inkscape-font-specification:'Noto Sans Bold';font-variant-ligatures:normal;font-variant-position:normal;font-variant-caps:normal;font-variant-numeric:normal;font-variant-alternates:normal;font-variant-east-asian:normal;font-feature-settings:normal;font-variation-settings:normal;text-indent:0;text-align:center;text-decoration-line:none;text-decoration-style:solid;text-decoration-color:#000000;letter-spacing:normal;word-spacing:normal;text-transform:none;writing-mode:lr-tb;direction:ltr;text-orientation:mixed;dominant-baseline:auto;baseline-shift:baseline;text-anchor:middle;white-space:normal;display:inline;vector-effect:none;fill:#1a171b;fill-opacity:1;stroke-width:0.264583;stroke-linecap:butt;stroke-linejoin:miter;stroke-miterlimit:4;stroke-dasharray:none;stroke-dashoffset:0;stroke-opacity:1;-inkscape-stroke:none;stop-color:#000000"
       x="109.4921"
       y="-9.160408"
       id="text9787-2-6-5-6-7-4-6-9-6-06-4-1-1-5-1-0-8"><tspan
         sodipodi:role="line"
         style="font-style:normal;font-variant:normal;font-weight:bold;font-stretch:normal;font-size:10.5833px;line-height:1.25;font-family:'Noto Sans';-inkscape-font-specification:'Noto Sans Bold';font-variant-ligatures:normal;font-variant-position:normal;font-variant-caps:normal;font-variant-numeric:normal;font-variant-alternates:normal;font-variant-east-asian:normal;font-feature-settings:normal;font-variation-settings:normal;text-indent:0;text-align:center;text-decoration-line:none;text-decoration-style:solid;text-decoration-color:#000000;letter-spacing:normal;word-spacing:normal;text-transform:none;writing-mode:lr-tb;direction:ltr;text-orientation:mixed;dominant-baseline:auto;baseline-shift:baseline;text-anchor:middle;white-space:normal;vector-effect:none;fill:#1a171b;fill-opacity:1;stroke-width:0.264583;stroke-linecap:butt;stroke-linejoin:miter;stroke-miterlimit:4;stroke-dasharray:none;stroke-dashoffset:0;stroke-opacity:1;-inkscape-stroke:none;stop-color:#000000;stop-opacity:1"
         x="109.4921"
         y="-9.160408"
         id="tspan61586-7">Normal day-to-day workflow</tspan></text>
    <text
       xml:space="preserve"
       style="font-style:normal;font-variant:normal;font-weight:bold;font-stretch:normal;font-size:10.5833px;line-height:1.25;font-family:'Noto Sans';-inkscape-font-specification:'Noto Sans Bold';font-variant-ligatures:normal;font-variant-position:normal;font-variant-caps:normal;font-variant-numeric:normal;font-variant-alternates:normal;font-variant-east-asian:normal;font-feature-settings:normal;font-variation-settings:normal;text-indent:0;text-align:center;text-decoration-line:none;text-decoration-style:solid;text-decoration-color:#000000;letter-spacing:normal;word-spacing:normal;text-transform:none;writing-mode:lr-tb;direction:ltr;text-orientation:mixed;dominant-baseline:auto;baseline-shift:baseline;text-anchor:middle;white-space:normal;display:inline;vector-effect:none;fill:#1a171b;fill-opacity:1;stroke-width:0.264583;stroke-linecap:butt;stroke-linejoin:miter;stroke-miterlimit:4;stroke-dasharray:none;stroke-dashoffset:0;stroke-opacity:1;-inkscape-stroke:none;stop-color:#000000"
       x="379.74084"
       y="-9.3720741"
       id="text9787-2-6-5-6-7-4-6-9-6-06-4-1-1-5-1-0-8-4"><tspan
         sodipodi:role="line"
         style="font-style:normal;font-variant:normal;font-weight:bold;font-stretch:normal;font-size:10.5833px;line-height:1.25;font-family:'Noto Sans';-inkscape-font-specification:'Noto Sans Bold';font-variant-ligatures:normal;font-variant-position:normal;font-variant-caps:normal;font-variant-numeric:normal;font-variant-alternates:normal;font-variant-east-asian:normal;font-feature-settings:normal;font-variation-settings:normal;text-indent:0;text-align:center;text-decoration-line:none;text-decoration-style:solid;text-decoration-color:#000000;letter-spacing:normal;word-spacing:normal;text-transform:none;writing-mode:lr-tb;direction:ltr;text-orientation:mixed;dominant-baseline:auto;baseline-shift:baseline;text-anchor:middle;white-space:normal;vector-effect:none;fill:#1a171b;fill-opacity:1;stroke-width:0.264583;stroke-linecap:butt;stroke-linejoin:miter;stroke-miterlimit:4;stroke-dasharray:none;stroke-dashoffset:0;stroke-opacity:1;-inkscape-stroke:none;stop-color:#000000;stop-opacity:1"
         x="379.74084"
         y="-9.3720741"
         id="tspan61586-7-1">Once, to get a new repo</tspan></text>
  </g>
</svg>
