{
  "chrome": {
    "default": "111.0",
    "versions": {
      "111.0": {
        "image": "selenoid/chrome:111.0",
        "port": "4444"
      },
      "mobile-111.0": {
        "image": "registry.gitlab.com/gitlab-org/gitlab-qa/selenoid-chrome-gitlab:mobile-111.0",
        "path": "/wd/hub",
        "port": "4444"
      }
    }
  },
  "MicrosoftEdge": {
    "default": "111.0",
    "versions": {
      "111.0": {
        "image": "browsers/edge:111.0",
        "port": "4444"
      }
    }
  }
}
