{
  "object_kind": "note",
  "event_type": "note",
  "project": {
    "path_with_namespace": "dependabot-gitlab/test"
  },
  "object_attributes": {
    "discussion_id": "f301b677df8a4787238ce030490a125c86cd1d15",
    "note": "test comment"
  },
  "merge_request": {
    "iid": 69
  }
}
