{
  "object_kind": "merge_request",
  "project": {
    "path_with_namespace": "dependabot-gitlab/test",
    "default_branch": "master"
  },
  "object_attributes": {
    "iid": 69,
    "state": "closed",
    "action": "close",
    "merge_status": "can_be_merged",
    "source": {
      "id": 17993652,
      "path_with_namespace": "dependabot-gitlab/dependabot",
      "default_branch": "master"
    },
    "target": {
      "id": 17993652,
      "default_branch": "main"
    }
  }
}
