module gitlab.com/gitlab-com/customer-success/education-services/instructor-led-training/ilt-development/ai-essentials

go 1.21.5

require github.com/common-nighthawk/go-figure v0.0.0-20210622060536-734e95fb86be
