[
  {
    "creation_date": 1644057368,
    "user_id": 6709058,
    "reputation": 81,
    "view_count": 13,
    "title": "Is there a way to allow non-root pods to write on glusterfs volumes",
    "body": "im trying to deploy gitlab to onpremises k8s cluster vagrant vms by helm chart i use own glusterfs cluster for volumes the trouble is that most containers delivered by that chart have parameter and that leads to write capability denied for them the possible ways i see are clone the chart to local modify to and run i cant pass this parameter by it seems gitlab chart do not support it add init container to every gitlab component with access rights patching not sure this could be done without extensive chart modifying find the way to deliver volumes with appropriate rights by modifying or this would be perfect solution my yamls on these are"
  },
  {
    "creation_date": 1644039933,
    "user_id": 7116458,
    "reputation": 11,
    "view_count": 19,
    "title": "how to create Snapshot &amp; Release Folder for Artifactory using CI pipeline?",
    "body": "i want to create snapshot amp release folder in jfrog artifactory using ci pipeline while doing deployment in gitlab can anybody help me on this"
  },
  {
    "creation_date": 1644005121,
    "user_id": 16389467,
    "reputation": 15,
    "view_count": 14,
    "title": "mocha: command not found in GitLab",
    "body": "i want to try cicd so i am working on a simple project i wanted to run the test file but i get the error mocha command not found there is no problem when i try it in my own terminal how can i solve this thanks"
  },
  {
    "creation_date": 1643967360,
    "user_id": 10030258,
    "reputation": 138,
    "view_count": 13,
    "title": "Cleaning up project directory and file based variables 00:01 ERROR: Job failed: exit code 1",
    "body": "i started learning gitlabci using a course on udemy below code is absolutely similar to the masters code but his code run correctly but my code release error what is wrong with below code error11 1 httpsistackimgurcomdwgiypng"
  },
  {
    "creation_date": 1643964479,
    "user_id": 13000747,
    "reputation": 15,
    "view_count": 17,
    "title": "remote: The project you were looking for could not be found or you don&#39;t have permission to view it",
    "body": "im getting this error while trying to deploy my branch through gitlab"
  },
  {
    "creation_date": 1643963280,
    "user_id": 14597864,
    "reputation": 161,
    "view_count": 34,
    "title": "Caching Rust/Wasm tools in Gitlab CI?",
    "body": "im working with wasm and rust and im deploying the page with gitlab pages im using a gitlabciyml file that looks like this but even for a hello world app this takes 12 minutes 11 minutes of that is taken by the step is there any way i can cache the intermediate step to avoid doing this every time"
  },
  {
    "creation_date": 1643962437,
    "user_id": 1901348,
    "reputation": 1290,
    "view_count": 12,
    "title": "Is it a good idea to add .pytest_cache to ci runner&#39;s cache?",
    "body": "as i understand stores a mtime of last check i curious if addition of it into cirunners cache could optimize the time of cijobs and maybe reduce unnecessary tasks i use gitlab ci and shared section between all jobs for instance but i think the question is quite general for all ciprocesses"
  },
  {
    "creation_date": 1643935529,
    "user_id": 15173118,
    "reputation": 15,
    "view_count": 12,
    "title": "Gitlab API not being able to view project variables",
    "body": "i am using postman to get the project based on projectid which works i have some variables within that project that i would like to get using i might need to change some settings within gitlab but dont know where to go since i thought i added the variables i would be authorized to get the variables edit i have a api token that i am using"
  },
  {
    "creation_date": 1643926396,
    "user_id": 2194266,
    "reputation": 1,
    "view_count": 31,
    "title": "GitLab pipeline rules:exists with more than 10000 files in repo",
    "body": "i am using a template for my cicd on gitlab i want to enable some jobs only for repositories with specific files i try to use rulesexists but my repositories contain more than 10000 files and gitlab has a restriction for performance reasons gitlab matches a maximum of 10000 exists patterns or file paths after the 10000th check rules with patterned globs always match in other words the exists rule always assumes a match in projects with more than 10000 files i can make checks on beforescript but i want to hide this job from the pipeline currently running gitlabee 1339 any help is much appreciated thanks in advance"
  },
  {
    "creation_date": 1643923513,
    "user_id": 5489656,
    "reputation": 31,
    "view_count": 9,
    "title": "Is there a way to make Cypress-Firefox testing as performant as Cypress-Chrome?",
    "body": "apologies for the vague question but ive noticed significant performance runtime differences in my e2e testing based on which browser tests are being run on any advice that results in hitting my timeouts less is appreciated"
  },
  {
    "creation_date": 1643919944,
    "user_id": 986003,
    "reputation": 315,
    "view_count": 5,
    "title": "How to deploy Tensorflow TFX pipeline with Git/Jenkins Orchestrating in Apache beam",
    "body": "i\u2019ve searched google and stack for this solution in pieces and can\u2019t seem to get a foot hold my main cloud of unknowing is if apache beam has the ability to ingest a tfx pipeline config file via gitjenkins and can kickoff via api or cli the pipeline for some reason i can\u2019t find clear documentation on it if anyone has documentation that would be great i\u2019ll continue my search as well i\u2019m hoping someone has done this before as i am stuck with jenkins for deployment"
  },
  {
    "creation_date": 1643915256,
    "user_id": 1108350,
    "reputation": 1636,
    "view_count": 20,
    "title": "What is wrong with my JupyterHub config file ? Error when using helm to install Jupyter",
    "body": "i am attempting to deploy jupyterhub into my kubernetes cluster as i want to have it integrated with a self hosted gitlab instance running in the same cluster i have followed the steps on the gitlab documentation page as shown here however when attempt to install this helm chart with this command i get the below errors i am using helm chart from httpsgithubcomjupyterhubhelmchart see below for my valuesyaml valuesyaml"
  },
  {
    "creation_date": 1643909496,
    "user_id": 10768251,
    "reputation": 1,
    "view_count": 12,
    "title": "Protractor to webdriverio migration",
    "body": "in our project we are planning to migrate from protractor to webdriverio i am trying to understand the below criteria if webdriverio can support datadogs validation api validation same script to support mobile and browser browser stack and other cloud browser services integrated to zephyr test data from database report generation in other formats as well script failure regrouping defects flaggingscript failure due to existing defects need to be flagged lesser result analyses time tool independent script gitlab pipeline for sanity and regression requirement traceability or test case coverage compare test case status across different runs"
  },
  {
    "creation_date": 1643906656,
    "user_id": 8518867,
    "reputation": 26,
    "view_count": 18,
    "title": "Gitlab CI for Spring Boot Maven stuck",
    "body": "i have a spring boot application with the following ci pipeline on my self hosted gitlab pomfile start of this week from one day to another it stopped working and stucks at did they change the rate limits so i run into a soft ban from maven repo now"
  },
  {
    "creation_date": 1643900067,
    "user_id": 10046524,
    "reputation": 324,
    "view_count": 71,
    "title": "GitLab CI pull docker from private registry",
    "body": "the situation im currently working on a project where i migrate the ci environment from jenkins to gitlab ci to get everything working ive built a few docker containers that should serve as base images for the ci pipeline these containers cannot be stored in the gitlab internal container registry and should be pushed to a artifactory instance what i already didtried so far i got everything going by using kaniko for the docker builds and the resulting images are correctly pushed to the artifactory registry so far so good however ive now reached a point where i have cijobs that should make use of previously built containerimages as their base image so they should be pulled from the artifactory instance which serves as private registry example config the problem with this is that i cannot make use of variable in the cisettings that is proposed in the official docs this is because my understanding when providing this variable in the project settings this would overwrite the default registrysettings but i need to preserve the values behind these internal variables because some of the first jobs make use of containerimages that are only present within this private gitlab instance is it possible to provide multiple authconfigs in the cicd variable settings and how would i reference the predefined variables in here since this important to keep the internal registry known i would imagine something like below which is part of the kaniko preconfiguration but cannot come up with a possible solution for this scenario in my understanding the variables can be overwritten in the ciconfiguration but this did not work for me would this require advanced configuration of the cirunner to achieve the desired behavior like outlined here in the docs really appreciate your help or hints"
  },
  {
    "creation_date": 1643899036,
    "user_id": 10876717,
    "reputation": 21,
    "view_count": 30,
    "title": "GitLab API - How to list all files in subfolder",
    "body": "im having quite the time trying to get this seemingly simplistic line of code to work using c trying to get a list of all my files in my repo file structure below this line of code lists all my directories and works great according to the api to get my files only i should use attribute or to get my files"
  },
  {
    "creation_date": 1643897156,
    "user_id": 9731202,
    "reputation": 91,
    "view_count": 30,
    "title": "How to avoid installing all centos packages everytime I run gitlab ci pipeline?",
    "body": "im running a gitlab ci pipeline with a centos image the pipeline has a before script that runs a set of commands gitlabciyaml installciyaml the issue is that everytime i run the ci pipeline it takes time to install centos and all its packages is there a way to avoid this or cache this operation somewhere"
  },
  {
    "creation_date": 1643895788,
    "user_id": 11060431,
    "reputation": 11,
    "view_count": 23,
    "title": "Assigning predefined variable to global variable",
    "body": "i have following pipeline that is a template for others that is why i want to assign cidefaultbranch as default value to targetbranch that can be then overriden by other branch name develop release etc if needed preconditions project default branch is master pipeline runs on master branch using this approach the job is not included in the pipeline but changing the variable like this adds the job to the pipeline the script section has the command to list all variables and their values in powershell both cicommitbranch and targetbranch have value in both cases but still on the first scenario rulesif does not seem to be true can someone explain why"
  },
  {
    "creation_date": 1643886338,
    "user_id": 8180615,
    "reputation": 419,
    "view_count": 32,
    "title": "Python on Gitlab has ModuleNotFound, But Not When I Run Locally",
    "body": "the following snapshot shows the file structure when i run on gitlab ci here is what i am seeing why is this error occurring when gitlab runs it but not when i run locally here is my file note that this had been working before i recently made a git submodule instead of being an actual subdirectory again it works locally when i tried with changing the gitlab ci file to use"
  },
  {
    "creation_date": 1643886069,
    "user_id": 9536103,
    "reputation": 614,
    "view_count": 24,
    "title": "Getting the current branch name when running code on gitlab",
    "body": "i have a python project on gitlab i am trying to access the current branch name using the code when i run this locally it correctly returns my local branch however when it runs on gitlab it is returning does anyone know how i can get the current branch name on gitlab"
  },
  {
    "creation_date": 1643885581,
    "user_id": 17603520,
    "reputation": 19,
    "view_count": 11,
    "title": "Database migration issue in gitlab after upgrading gitlab",
    "body": "recently i have upgraded gitlab after which few database migrations are not yet migrated and are showing status as down we have tried sudo gitlabrake dbmigrate but still some migration are failing"
  },
  {
    "creation_date": 1643881696,
    "user_id": 8219832,
    "reputation": 478,
    "view_count": 15,
    "title": "Running Flutter Web integration tests inside gitlab (probably github too) Ubuntu VM fails because of Chromedriver",
    "body": "i am trying to run integration tests for web inside gitlab vm the vm is running ubuntu 20043 lts chromedriver is launched with this command line the error from the chromedriver output is using chrome 97 or 97 along with chromedriver 97 or 98 gives the same error flutter integration tests is launch using this command initializesandbox called with multiple threads in process is know issue and is fixable using the flag disablegpu but until know i havent found any solution to disable gpu from within the flutter cli or by configuring the flutterdriver any idea on how to solve this problem thanks"
  },
  {
    "creation_date": 1643880301,
    "user_id": 15254436,
    "reputation": 51,
    "view_count": 29,
    "title": "Git push failure",
    "body": "i am trying to push to git and am getting this error message i have already tried but this resulted in a different but similar message any help would be much appreciated"
  },
  {
    "creation_date": 1643876491,
    "user_id": 4955448,
    "reputation": 9,
    "view_count": 17,
    "title": "Failed to connect to repository Error while Building the Maven Jenkins Job",
    "body": "here is the error i get when trying to configure the scm url of the job how can i get past this error"
  },
  {
    "creation_date": 1643876011,
    "user_id": 18054553,
    "reputation": 11,
    "view_count": 16,
    "title": "How can I read json file from Gitlab API url?",
    "body": "i wanted to extract the json file from gitlab api call url this url also need authorization token to run this api call so basically i have developed a pandas code on parsing json code to excel and i read that json file through the file saved in my desktop but i need a fully automated code wherein the json code is taken up from the gitlab api urlpostman is the platform which i am using to pull the json code and to access the json code we need to enter our accessauthorizationbearer token so how do should i go about it"
  },
  {
    "creation_date": 1643870890,
    "user_id": 13519287,
    "reputation": 23,
    "view_count": 23,
    "title": "Failure in CICD Pipeline when trying to push on GitLab",
    "body": "i am working on a project that i recently pushed to git lab i am unable to discern what error it is as i am rather new with cicd pipeline and i am hoping someone would be able to help me with this the error is shown below appreciate all the help i can get"
  },
  {
    "creation_date": 1643868995,
    "user_id": 12157105,
    "reputation": 11,
    "view_count": 26,
    "title": "Cypress run on Gitlab CI/CD always failed but work properly on local run using Chrome image &amp; node",
    "body": "i have configured my cypress test in the gitlab cicd pipeline however in my local environment it runs perfectly no errors however when the pipeline job runs only 2 specs are successful for the rest are in errors cypress version chrome version running mode here are the parameters of my file i dont know if anyone has ever seen this error thank you for your help"
  },
  {
    "creation_date": 1643862796,
    "user_id": 8096208,
    "reputation": 210,
    "view_count": 18,
    "title": "Get the issues mentioned in the merge request",
    "body": "is there an api in gitlab that can fetch the issues mentioned in the merge request i keep looking at the documentation but i cant find it id like to take advantage of this and try to automate it"
  },
  {
    "creation_date": 1643841287,
    "user_id": 17974740,
    "reputation": 11,
    "view_count": 27,
    "title": "Opening python file in different directory in linux",
    "body": "im attempting to open a file in a different directory than what i am calling my python file from im also using gitlabci when calling my python file as well here is a tree of how its laid out calling python file from root py file opens a file to edit in a deeper location im wondering how i can access without using os or any other modules it is unknown what our root directory is either so i cannot simply do ive tried and and have had no luck if i use gitlab ci to then would that open me up more options if i do the cd do all my future in gitlab ci run from the cd location and id need to cd to get back to root im new to gitlabci and trying to avoid pushing all of my tests to gitlab and trying to solve this in one answer"
  },
  {
    "creation_date": 1643837923,
    "user_id": 6093604,
    "reputation": 3520,
    "view_count": 33,
    "title": "Docker-Compose - Import private repositories in go test",
    "body": "i just ran into a super weird issue and i really dont get whats currently happening i had a project while some e2e tests everything was working fine for some reason i had to use some privates repositories from gitlab of mine as i developed some layers related to databases and others purposes the thing is when i tried to run from docker compose command its now failing with the following message i have a simple docker compose that runs 3 containers mongodb elasticsearch custom golang docker image my dockerfile has a small script which help me and which is working to know when everything is ready for a full test dockerfile dockercomposetestse2eyml everything seems to work as before until the which from now on at go get time cannot fetch my private repository thanks for any help i really did search to inject ssh so setup git and everything but it seems to have something to do with dockercompose not my dockerfile image or my golang command thanks again best max"
  },
  {
    "creation_date": 1643819442,
    "user_id": 9877279,
    "reputation": 563,
    "view_count": 6,
    "title": "Need azure functions Core Tools at maven build Job in Gitlab CI",
    "body": "we used gitlab ci to build the jar and deploy the azure function here build job failed due to the default base image used is maven latest please suggest that is there any way to importdownloadinstall noderelated dependencies to maven job"
  },
  {
    "creation_date": 1643819254,
    "user_id": 3442437,
    "reputation": 77,
    "view_count": 29,
    "title": "Gitlab CI Pipeline Failed - HTTP Basic: Access denied",
    "body": "after upgrade gitlabrunner to 1460beta71 gf035ecbf i got the following error after the ci pipeline in gitlab got executed any suggestions on how to fix this tried docker login locally and its always successful"
  },
  {
    "creation_date": 1643819201,
    "user_id": 5580578,
    "reputation": 575,
    "view_count": 7,
    "title": "Gitlab-CI: Access nginx service in script section",
    "body": "how can i access the nginx service in the script section of a gitlabci job at the moment i always get the error according to the bitnami nginx documentation the container should display the standard page on port 8080"
  },
  {
    "creation_date": 1643814802,
    "user_id": 13377928,
    "reputation": 89,
    "view_count": 31,
    "title": "How can I make someone review my code on GitLab and not give them permission to clone it?",
    "body": "my manager asked me to add a person to my gitlab repo to review it but this person should not be able to to clone it also can i add a person but so they can see only the branches that i want them to see and not all branches thank you in advance"
  },
  {
    "creation_date": 1643812731,
    "user_id": 4896472,
    "reputation": 1579,
    "view_count": 16,
    "title": "Can `needs:ref` take a tag in GitLab?",
    "body": "given 2 projects proja and projb proja has a job projb has a job is a tag on proja on gitlab 146 gives the following error why does this fail so badly and how can i get it to work"
  },
  {
    "creation_date": 1643810778,
    "user_id": 11164691,
    "reputation": 570,
    "view_count": 16,
    "title": "Deploy on heroku with Gitlab CI suddenly JSON::ParserError",
    "body": "my deploy process of an app to heroku is suddenly not working today and i cant find anything for this i have an error but i cant find any way to debug it here is what i have the fact is that my ci was working yesterday if i run again an old pipeline it will not crash i checked all dependencies are still the same ruby version is the same dpl version is the same my heroku app name is correct"
  },
  {
    "creation_date": 1643808618,
    "user_id": 5446749,
    "reputation": 15199,
    "view_count": 20,
    "title": "Make sure a job is rerun in later pipelines if it has failed in previous pipeline and is subject to files changes rules in Gitlab CI",
    "body": "i have a gitlab ci job that has a rule making the job run if any of 3 paths are modified i made the job fail purposefully then i modified the a file that is not tracked by the job rule and i pushed a new commit but the job was not retried it therefore does not show the pipeline as failing while the failing job has never been fixed it just has not been rerun what kind of rules can i set such that a job has a affected by some files and a job is retried at every pipeline in the branchmr if it has not been resolved regardless of status the pipeline i have the following file architecture"
  },
  {
    "creation_date": 1643808018,
    "user_id": 8523305,
    "reputation": 33,
    "view_count": 7,
    "title": "Use `remotes::install_gitlab()` to install custom RMarkdown template package from company hosted GitLab",
    "body": "my company has hosted a private gitlab server which im accessing via vpn from my laptop i am currently working on some technical reports repository 1 using rmarkdown and decided to create a template package for my rmarkdown html template files in a separate private repository repository 2 my goal is to install the package from repository 2 from within the project of repository 1 in rstudio i tried using for this purpose however i get an error message i do not really understand my guess is that this is mostly because its the first time i got in touch with gitlab so maybe there is a very obvious solution i simply couldnt find it yet what im trying to do first of all the url is trying to open really does not exist but i can access the repo via without any problems i understand that it tries to use gitlabs api to install the repository however i dont understand whats going wrong here is there a problem with my authentication do i need to create some kind of access token im not aware of thank you all for your input"
  },
  {
    "creation_date": 1643801802,
    "user_id": 11012410,
    "reputation": 43,
    "view_count": 16,
    "title": "Gitlab The term &#39;bundle&#39; is not recognized as the name of a cmdlet, function, script file, or operable program",
    "body": "i am trying to implement cicd for flutter with gitlab i am using fastlane to deploy the app to firebase for distribution my script inside gitlabciyml is following"
  },
  {
    "creation_date": 1643794585,
    "user_id": 8899060,
    "reputation": 471,
    "view_count": 22,
    "title": "Rebase the feature branch",
    "body": "i have deleted the copy of my feature branch from my local machine after that i have cloned my feature branch and did the modification there and send the merge request to master now gitlab is asking me to do rebase but when i am trying to do it it fails and says rebase failed please rebase locally how can i do it now"
  },
  {
    "creation_date": 1643785031,
    "user_id": 309852,
    "reputation": 6214,
    "view_count": 27,
    "title": "How to give an API read permission on GitLab to only a single repository?",
    "body": "it is possible on github to authorize 3rd party appservice to only access a single repository i did not find such possibility for gitlab it seems that you can only give access to everything is it correct or theres a better way"
  },
  {
    "creation_date": 1643782451,
    "user_id": 18054553,
    "reputation": 11,
    "view_count": 29,
    "title": "Reading json file from Gitlab API call url",
    "body": "i wanted to extract the json file from gitlab api call url this url also need authorization token to run this api call so basically i have developed a pandas code on parsing json code to excel and i read that json file through the file saved in my desktop but i need a fully automated code wherein the json code is taken up from the gitlab api urlpostman is the platform which i am using to pull the json code and to access the json code we need to enter our accessauthorizationbearer token so how do should i go about it"
  },
  {
    "creation_date": 1643777064,
    "user_id": 3438385,
    "reputation": 11,
    "view_count": 16,
    "title": "Just registered GitLab runner and getting Authentication failure when using shell type",
    "body": "just installed gitlab runner service and tried to run a basic job i got the following output password su authentication failure error job failed prepare environment exit status 1 check httpsdocsgitlabcomrunnershellsindexhtmlshellprofileloading for more information googling i found that the contents of the bashlogout may be a problem but my bashlogout was blank i created and added ssh keys for the gitlabrunner user and was able to manually clone via ssh but i cant get the job to run anyone experienced this that can offer a suggestion"
  },
  {
    "creation_date": 1643776605,
    "user_id": 18053952,
    "reputation": 39,
    "view_count": 25,
    "title": "git remote add clarification",
    "body": "i just set up a local git repo gt github everything is working fine but would like some clarifications on the github walkthrough so i have a better understanding of whats going on is this simply designating what branch to put my files into on github if i had changed my github repo branch to thunder would the code then be what exactly does origin mean again why origin and what does the main do this all does work im able to simply to push my files i just dont fully understand what some of the code means thanks for clarification"
  },
  {
    "creation_date": 1643751248,
    "user_id": 12619046,
    "reputation": 11,
    "view_count": 29,
    "title": "Check that gitlab branch has changes before running jobs",
    "body": "in order to stop the current default gitlab behaviour of starting pipelines on branch creation i am trying to add a check in each job so that only merge requests trigger jobs when they have changes this is what i got so far i am not quite familiar with bash which is surely the problem because i am currently encountering a yaml invalid error d ps is there maybe a better way to do this instead of adding the check to each task"
  },
  {
    "creation_date": 1643740796,
    "user_id": 12054406,
    "reputation": 99,
    "view_count": 46,
    "title": "Is there a way to dynamically choose whether a job is run in a Gitlab CI pipeline?",
    "body": "i am trying to have one job check for a word being present in a config file and have that determine whether a subsequent trigger job occurs or not like so it seems like ive reached a limitation with gitlab because the job doesnt even get created due to the fact that the pipeline initializes with so it doesnt matter that im doing this check to trigger the pipeline later if the keyword was found is there any way to dynamically decide if this job would be created or not i would just put it all in one job and trigger the downstream pipeline through the api but then of course i cant depend on the downstream status which is something i want as well and isnt possible to do when triggering through the api from everything ive found in the docs any advice would be appreciated thanks"
  },
  {
    "creation_date": 1643732299,
    "user_id": 3955685,
    "reputation": 1619,
    "view_count": 32,
    "title": "Bash - Gitlab CI not converting variable to a string",
    "body": "i am using gitlab to deploy a project and have some environmental variables setup in the gitlab console which i use in my gitlab deployment script below my environmental variables are declared like so the plan is that it grabs the bucket url from the environmental variables depending on which branch is trying to deploy the problem is that the variable does not seem to get set properly and i get the following error it looks like it picks up the environmental variable value fine but does not set it properly any ideas why"
  },
  {
    "creation_date": 1643729518,
    "user_id": 688954,
    "reputation": 3610,
    "view_count": 84,
    "title": "Evaluate subtraction inside GitLab CI VARIABLES keywords",
    "body": "i am trying to parallelize flutter build using gitlab using gitlabs keyword and flutters and something like below however this script fails in the last job because offbyone error seems like it is undocumented that starts from 1 instead of 0 i wanted to subtract the variables by using to because the variable is being used multiple times throughout this long job the script in the example above is shortened i tried this the script still fails since the value of is literal string instead of or whatever integer value needed this actually works in my local terminal how do i fix this"
  },
  {
    "creation_date": 1643728816,
    "user_id": 9112151,
    "reputation": 501,
    "view_count": 38,
    "title": "gitlab-ci.yml: jobs dependencies",
    "body": "imagine there are stages and one need to split stage into smaller jobs like etc jobs can be run only when worked i tried this but its not working error"
  },
  {
    "creation_date": 1643725766,
    "user_id": 16218760,
    "reputation": 51,
    "view_count": 21,
    "title": "GITLAB CI/CD: How to know if a pipeline is a tag pipeline, an MR pipeline or a scheduled pipeline?",
    "body": "theres a part of the script which i want to run only if its a tag pipeline how do i represent that as a condition"
  },
  {
    "creation_date": 1643715297,
    "user_id": 17541709,
    "reputation": 323,
    "view_count": 25,
    "title": "Adding getignore to bin and obj prevent the project to work and disable them",
    "body": "i have created gitignore file and put inside it bin obj the folders are not uploading to the remote resporty as i want but the visual studio disable them and thus my project is not working see the image below how can i fix it"
  },
  {
    "creation_date": 1643713625,
    "user_id": 3022575,
    "reputation": 38,
    "view_count": 41,
    "title": "ansible playbooks is not working from gitlab pipeline",
    "body": "i have configured the ansible for my gcp instances running from gitlab using the container i was able to ping the windows instance but unable to run playbooks as i am getting permission denied error please refer to the below pipeline link for debug logs i have tried all the options amp suggestions on the internet but none of them did work repository pipeline at last i have built the image on the gcp cloud shell and logged into the container and followed the steps same as pipeline and surprisingly its working without any issue so the same code is working in the gcp cloud shell but its not working from the gitlab pipeline i couldnt figure out why can someone please help"
  },
  {
    "creation_date": 1643711791,
    "user_id": 3955685,
    "reputation": 1619,
    "view_count": 22,
    "title": "Gitlab CI - Compute variable name based off another variable",
    "body": "i am trying to use a variable that is compiled partly from another variable based off the branch name i have environmental variables configured in gitlab like so the branch that i am deploying on is called development and the idea is to be able to call the variable dynamically depending on the branch it is currently on so far i have managed to get this far unfortunately the above only outputs to the console not the value of which should be not sure what ive done wrong here copied a bit from this link here but does not seem to work"
  },
  {
    "creation_date": 1643708082,
    "user_id": 17541709,
    "reputation": 323,
    "view_count": 21,
    "title": "Using Git push from local to a child folder in Remote Repository (Not the root) - GitLab",
    "body": "in my remote repository i have a branch called myproject and have three sub folders myproject root folder1 code folder2 documents folder3 notes i use the following command to push however all the files are pushed to the root gt myproject while i need to push them to the code subfolder ive looked at this article but it doesnt give me a good insight to solve this issue"
  },
  {
    "creation_date": 1643707796,
    "user_id": 4960953,
    "reputation": 8536,
    "view_count": 50,
    "title": "Gitlab CI: how to load vars from JSON file",
    "body": "im creating aspnet core applications using gitlab ci and dockerindocker so at first stage i build dockerfiles and push them in repo at the second stage i apply yamls to deploy from repo to cluster k8s doesnt allow to run containers at port 80 in my configuration so i need to expose ports for dockerfiles what i want to do load correct port numbers from aspnet config file in gitlab cicd i dont want to hardcode that values in gitlab job or in gitlab variables at the current moment im going this way i hardcoded to expose correct port how to read it value from json file json file looks like this also i can add additional var to json for example but still cant figure out how to read this value in gitlab ci"
  },
  {
    "creation_date": 1643706789,
    "user_id": 8392335,
    "reputation": 27,
    "view_count": 19,
    "title": "GitLab run not picking changes in gradlew file",
    "body": "i have done some changes in gradlew locally in run they are getting reflected but from gitlab same thing is not working below is my yaml file is there anything i need to change in terms of caching or something else to make it effective"
  },
  {
    "creation_date": 1643702467,
    "user_id": 4130619,
    "reputation": 1278,
    "view_count": 52,
    "title": "How can I set default branch name to &quot;master&quot; on GitLab?",
    "body": "note that i am not looking to change it for a specific repo i want to change it per account so any new created repository will have a correct default see set default name for default branch in github for a github equivalent i found httpsaboutgitlabcomblog20210310newgitdefaultbranchname which is not mentioning such configuration so it may be not existing at all httpsdocsgitlabcomeeuserprojectrepositorybranchesdefaulthtml has an option for an individual repo to update the default branch name for an individual project there is option for the entire instance or group gitlab administrators can configure i see nothing that would allow change for a given user without selfhosting own gitlab instance"
  },
  {
    "creation_date": 1643702083,
    "user_id": 18088017,
    "reputation": 1,
    "view_count": 13,
    "title": "Traefik: port forwarding not possible for new ports",
    "body": "i would like to add a docker service to an existing traefikdocker infrastructure and publish it via port forwarding the existing infrastructure was not set up by myself and being quite new to traefik i have some trouble understanding what is going on the existing services are accessable via eg machinesubnetdomain8080 now i would like to add gitlab as a service the gitlab container is up and running and locally accessable if i connect the gitlab service to an existing entrypoint port 80808085 it can be accessed but gitlab needs to run on a new port eg 8086 and this fails i spent a lot of time looking for any port restrictions or anything like that my predecessor could possibly have installed for security reasons but without success do i have to explicitly allow any new ports in the host machine any hint why adding a new portentrypoint could fail is highly appreciated the relevant part of the traefik compose file looks like so lines that were added by myself are marked with this is the gitlab compose file thanks in advance"
  },
  {
    "creation_date": 1643701461,
    "user_id": 2186582,
    "reputation": 242,
    "view_count": 18,
    "title": "Error while build image via gitlab cd/cd - Error while fetching server API version",
    "body": "operation system centos linux release 832011 x8664 i try build image when push to master this is my simple cicd config file gitlabciyml while pipeline running i have next error i checked permission on sock files docker service is running on host machine have anybody ideas"
  },
  {
    "creation_date": 1643682447,
    "user_id": 4451521,
    "reputation": 4829,
    "view_count": 38,
    "title": "How to git control code from a remote computer?",
    "body": "i have the following situation and would appreciate advice i have a remote workstation wsa in which i have code written i write and execute the code in this workstation i access wsa through from my local linux computer locm i also use visual studio code remote extension to directly code the code in the workstation i transfer files from and to the wsa using the worskation wsa does not have access to the internet so i would like to do the following git manage my code simple enough git is installed in the workstation so no problem keep a repository of this code in my local machine locm keep a repository of this code in gitlab or github alternatively how can i do 2 and 3"
  },
  {
    "creation_date": 1643675703,
    "user_id": 4296405,
    "reputation": 820,
    "view_count": 35,
    "title": "Gitlab CI - Test are OK but the job fail",
    "body": "im new to gitlab ci and ci in general the unit test pass but the gitlab job fails here is my i want to test my project in php 74 and php 80 and if possible testing symfony 54 and 60 in php 80 buit not sure how to do that for now for both job 74 and 80 i have this in the last lines of the log both the deprecation doesnt seem to come from my code so i dont know how i can fix them and i dont have them when i launch phpunit from phpstorm are deprecations cause a job to fail if thats the problem can i silence them"
  },
  {
    "creation_date": 1643657223,
    "user_id": 8599834,
    "reputation": 1331,
    "view_count": 17,
    "title": "Expected packages seem not to be installed/available",
    "body": "i have two jobs in a pipeline defined as follows however when the pipeline runs the command outputs which is a version i have installed on the instance where the runner is installed but the pythonalpine315 image clearly installs 310 why is it not available then i also tried just but that uses a python 2 version similarly the job shows although nodelatest does install i believe the two issues have the same cause hence why i posted both in the same question but im not very experienced with gitlab ci so i dont know what im doing wrong"
  },
  {
    "creation_date": 1643649500,
    "user_id": 18083134,
    "reputation": 3,
    "view_count": 29,
    "title": "Easy way for deploy helm chart and testing them?",
    "body": "im new to k8s now i have k8s cluster with zero trust and testing immediately on it using git push and waiting for deployment via gitlab ci obviously this is the wrong way i would like test locally using minikube with the ability to quickly see the changes some hot reload for helm raising a local cluster that is close to productive zero trust and other things googled this problem and found httpsskaffolddev httpsgithubcomgardeniogarden the essence of the question i ask you to suggest the right solution can the utilities above help with this problem thanks for the answer"
  },
  {
    "creation_date": 1643645664,
    "user_id": 1323392,
    "reputation": 1461,
    "view_count": 31,
    "title": "How to find empty repos (zero commit) in GitLab",
    "body": "im using gitlab 119 its old i know and i need to list all the repositories that have been created but that are empty o with zero commits is it possible to list them from admin interface o via api"
  },
  {
    "creation_date": 1643642817,
    "user_id": 17050626,
    "reputation": 57,
    "view_count": 24,
    "title": "Migrating Gitlab Container Registry To Azure Contaner Registry",
    "body": "i am trying to migrate gitlabce container registry to azure container registry the command im using and it works what im trying to do now since there is no direct migration in the internet is to create a script to automate the migration process my idea is like this the problem is i couldnt find any command to list projectrepos or tags using gitlab command line is there another way to automate the migration if i couldnt find the commands"
  },
  {
    "creation_date": 1643640428,
    "user_id": 1942555,
    "reputation": 498,
    "view_count": 58,
    "title": "Run gitlab pipeline only for commits",
    "body": "currently gitlab runs a pipeline when creating a merge request branch with the gui is it possible to skip this pipeline since its only repeats the last pipeline from the default branch we tried with this works to skip new branch pipelines but it doesnt run a pipeline for new commits on branches which have no merge request"
  },
  {
    "creation_date": 1643638788,
    "user_id": 16314482,
    "reputation": 33,
    "view_count": 15,
    "title": "SonarQube report points to localhost on GitLab",
    "body": "hello i have set up cicd on my project using sonarqube my sonarqube is hosted on a server and gitlab connects to it but for some reason after the analysis is finished it posts a summary of the analysis as a comment on merge request but the link is directed to localhost9000 not my server link where the analysis can actually be accessed how could i make it point to my server link"
  },
  {
    "creation_date": 1643638005,
    "user_id": 9087488,
    "reputation": 11,
    "view_count": 29,
    "title": "Multiple Visual studio projects (one solution) in gitlab",
    "body": "i am bit new to gitgitlab we are moving from visual source safevss to gitlab we have a visual studio solutions with multiple projects20 to 25 it was easy to create repository structure in vss as individual projects how does it work with gitgitlab can i create individual repositories in gitgitlab and then pull them to make a solution how do commit push work i tested with 1 single solution containing 2 projects but since the projects are in different repositories i have to toggle the main branch for each commit for respective projects how can gitgitlab support one solution with multiple projects where each project having separate repository thank you for your help babu"
  },
  {
    "creation_date": 1643633797,
    "user_id": 13423010,
    "reputation": 29,
    "view_count": 20,
    "title": "Run deploy automatically when branch receives MR on Gitlab",
    "body": "i want to run automatically my deploy job on gitlab when my branch receives a merge by merge request how can i do this"
  },
  {
    "creation_date": 1643629463,
    "user_id": 18080543,
    "reputation": 1,
    "view_count": 6,
    "title": "Trace Gitlab Pipeline events",
    "body": "is there a way through which gitlab cicd pipeline can be traced using opentelemetry jaegar from what id understand after going through gitlab official guide is that currently there is no plugin available to integrate otel with gitlab any suggestionwa would be greatly appreciated thank you"
  },
  {
    "creation_date": 1643628841,
    "user_id": 13000747,
    "reputation": 15,
    "view_count": 22,
    "title": "fatal: Authentication failed for &#39;https://gitlab.com/",
    "body": "i only have some basic knowledge in devops and the dev who set up our gitlab project quit the team without leaving us with config instructions i tried doing a release but i came across this authentication error this is the release part in gitlabciyml i changed the email and this is the commitrelease function"
  },
  {
    "creation_date": 1643628337,
    "user_id": 7419139,
    "reputation": 179,
    "view_count": 17,
    "title": "What can cause: There was a problem authenticating with your cluster. In Gitlab?",
    "body": "hi im trying to authenticate a kubernetes cluster with gitlab im doing it via the certificate method and followed the guide on gitlabs documentation but it doesnt connect gitlab tells me there was a firewall issue my boss thought would be the reason but now that the firewall issue has been resolved and the problem persists i dont know what could be the cause is there some log file that could help me pin down the reason one thing i noticed is that shows the url to be a private ip i dont know for sure but i thought ive dealt with a few programs that only respond to requests within the network when the url is local could this be an issue i tried changing the server ip in to the public ip but then did not terminate anymore"
  },
  {
    "creation_date": 1643623247,
    "user_id": 10087954,
    "reputation": 29,
    "view_count": 36,
    "title": "How to share passwords to team on Gitlab without containing password on source?",
    "body": "i wonder if there is a git feature that share the passwords in the source code with the team after they enter their credentials to pull however the passwords should not be display in the source code in public i mean lets say i push the database credentials as variables like dbusername dbpassword and a team mate pull the source code after is there a way to my team mate can also pull the real credentials instead variables i wonder how does large development teams handle with the situation like this"
  },
  {
    "creation_date": 1643622369,
    "user_id": 18079585,
    "reputation": 1,
    "view_count": 25,
    "title": "Gitlab CI: How do I make `rules.changes` to compare changed file to main branch?",
    "body": "i am trying to create a base image for my repo that is optionally rebuilt when branches merge requests make changes to dependencies lets say i have this pipeline configuration lets say i push to a new branch and the first commit changes the docker image is build and pushed the dotenv is updated and the job successfully uses now lets say i push a new commit to the same branch however the new commit does not change so the job does not run now the stage pulls the wrong default while i would like it to still pull since it builds on top of the previous commit any ideas on how to deal with this is there a way to make refer to any other ideas on how to achieve what i am trying to do"
  },
  {
    "creation_date": 1643621452,
    "user_id": 14977779,
    "reputation": 41,
    "view_count": 22,
    "title": "Gitlab group permission management, access for developer",
    "body": "i have set up a gitlab solution in our company we would like to be able to store our projects in groups i would like each user to be able to create a project in the groups and to have the rights on his project from what i have seen a user must have developer rights on the group to create a project with the developer right the user is not a maintainer of his project so he cant modify the parameters nor push on the master branch a user with maintainer rights on the group can create a project and access the parameters of his project however he also becomes maintainer of other users projects this is not desired from what i could see it is linked to this issue httpsgitlabcomgitlaborggitlabissues17095 which is more than 4 years old what solution could you propose to me so that a user can create projects in a group and that he has the rights on his project without having maintainer rights on the projects of other users thank you latest gitlabee version 1470"
  },
  {
    "creation_date": 1643621431,
    "user_id": 17013344,
    "reputation": 43,
    "view_count": 22,
    "title": "how to store branch name in variable if branch exists?",
    "body": "in the script section of this job i want to pass the term master only if master branch exists otherwise i want to pass main how can i do this"
  },
  {
    "creation_date": 1643619724,
    "user_id": 16033899,
    "reputation": 52,
    "view_count": 24,
    "title": "How to push commit from remotes/origin/feature/branch to remotes/gitlab/feature/branch",
    "body": "i am new to the git and gitlab i need to push the commit to both gitlab and originbut i forgot to push the commit to gitlab i pushed it to the origin only so my gitk all status looks like below gitk all query how can i make sure that latest commit should also go to the gitlab branch and my status looks like below expectation i tried to do below command after few trials git push gitlab git push origin git pull"
  },
  {
    "creation_date": 1643592951,
    "user_id": 11807630,
    "reputation": 15,
    "view_count": 31,
    "title": "Gitlab CI variables in jobs",
    "body": "ive got some trouble defining a job im in an early stage of defining my pipeline and im trying to solve my problems with variables ive got a few subfolder under in gcplivedevelopment and im trying to them and then run terraform stuff but according to my failing pipeline the first script part doesnt enter the expected folder at ive got some debug outout which tells me following am i missing something combing two variables hope you can help me out"
  },
  {
    "creation_date": 1643580929,
    "user_id": 5896263,
    "reputation": 623,
    "view_count": 22,
    "title": "Gitlab CI/CD invalid format error on ssh-add",
    "body": "my problem is similar to this one but i have tried all the ways and i cant get it to work i have the sshprivatekey variable set because if i do echo in the same beforescript i can see it i have tried with a line break at the end of sshprivatekey but it doesnt work from my local machine i can do this without problem my config"
  },
  {
    "creation_date": 1643576656,
    "user_id": 17507139,
    "reputation": 1,
    "view_count": 13,
    "title": "how can i get the gitlab CI Jobs error log?",
    "body": "when i try to build a pipeline job from the gitlab ci i got some error but i cant get the error logs so i cant resolve the problem heres my sample pipeline script stages build test variables lang enusutf8 beforescript yarn install cd ios ampamp pod install repoupdate ampamp cd fastlane build stage build script fastlane test tags macos test stage test script fastlane atest tags macos1 2"
  },
  {
    "creation_date": 1643575666,
    "user_id": 18074944,
    "reputation": 1,
    "view_count": 16,
    "title": "How to Write CI/CD to build Ionic Project",
    "body": "i want to write cicd pipeline to build an ionic project how can i do that and reference documents will also help i am not using firebase anywhere in my project currently i am using gitlab as cicd pipeline"
  },
  {
    "creation_date": 1643570269,
    "user_id": 18074944,
    "reputation": 1,
    "view_count": 26,
    "title": "CI CD ionic Project . Configuring gitlab-ci.yml?",
    "body": "i want to configure a gitlabciyml file for an ionic projects and still confusing whats the main stages for every projects for the ci cd configuration difference between the build and the deploy stages how can implement a build stage for ionic project this is my try for the gitlabciyml in my project"
  },
  {
    "creation_date": 1643561039,
    "user_id": 17862362,
    "reputation": 65,
    "view_count": 20,
    "title": "Revert last commit using hash on remote repository (bitbucket)?",
    "body": "i made some changes and push them to the remote repository bitbucket then i need to revert this commit and i can easily revert on local using but i am not sure how should i revert the pushed commit on the remote repository bitbucket so how can i do this"
  },
  {
    "creation_date": 1643556660,
    "user_id": 18073363,
    "reputation": 1,
    "view_count": 28,
    "title": "Can I make a repo from an array, pulled from a .YML list, using Gitlab&#39;s CLI?",
    "body": "using bash and gitlabs cli im looking into a yml then trying to make a repo based on todo items its becoming a problem when i look into the array for the item called todo object im sure its simple perhaps im using incorrect syntax using gitlab cli the yml contents a top level grouptls sub levelsls todo is my array with some items named todo object those are the only ones im looking to make a repo for updated i could have been more specific in doing so i found my answer figured out syntax and answered this one shortly after so i asked my question which was essentially three using a yaml for a gitlab repos creation this is found in the documentation for the tool used here yq located here anyone parsing yaml for this purpose i encourage read extensively it is quite the little processor httpsmikefarahgitbookioyq httpsmusicapplecomusalbumblacksun958998203i958998205"
  },
  {
    "creation_date": 1643555833,
    "user_id": 6134158,
    "reputation": 59,
    "view_count": 14,
    "title": "copy a uploaded file in a git branch to the box where runner is executed using pipeline",
    "body": "i have created a branch in my gitlab and manually uploaded files into this branch using upload option now how can i copy this files into the box where the runner is executed using the pipeline yml file eg"
  },
  {
    "creation_date": 1643524283,
    "user_id": 12714940,
    "reputation": 41,
    "view_count": 53,
    "title": "You are not allowed to push code to this project",
    "body": "i have created a project and cloned it in my local machine i have done a change and i have committed it without problems now i am trying to push those changes from local to the remote repository in gitlab i got this error message how i can fix the issue"
  },
  {
    "creation_date": 1643514140,
    "user_id": 8810271,
    "reputation": 1532,
    "view_count": 29,
    "title": "How to prevent Git from storing copies of LFS files in .git dir?",
    "body": "it seems that git is storing copies of lfs files in this is taking twice of the space i know this is a typical way git handles the files but im still wondering if there is a way to prevent git from caching copies of them and just download from cloud when trying to revert the files"
  },
  {
    "creation_date": 1643467406,
    "user_id": 13756068,
    "reputation": 23,
    "view_count": 31,
    "title": "Asset linking with gitlab release cli using paramter expansion",
    "body": "i was attempting to attach a variable number of releases to a gitlab release by doing the following this allows me to produce a json string that seems to adhere to the formatting as specified here gitlab release docs unfortunately the problem arises in the following segment where i try parameter expansion to append the command argument to the array elements and add it as an argument to the releasecli command this leads to the following error incorrect usage flag provided but not defined assetslink the interesting aspect here is that the error is targeted at the json associated with the second release which led me to believe that the hyphen was being escaped for the rest of the array elements so i tried to remedy that situation by adding extra hyphens to all assetlinks after the first one but the error persists alternatively i tried to add a backslash character to the command argument assetlinks but to no avail as well thank you for any suggestions"
  },
  {
    "creation_date": 1643391614,
    "user_id": 13477558,
    "reputation": 21,
    "view_count": 71,
    "title": "Failing to push origin to GitLab",
    "body": "having a hard time learning how to push my git repository to gitlab currently getting this error ssh connect to host gitlabstudidintnuno port 22 connection timed out fatal could not read from remote repository please make sure you have the correct access rights and the repository exists i think i have connected my ssh on the gitlab website however i did have some issues on that end too and im therefore unsure whether i did everything right most notably when asked to enter a passphrase my cmd would not take any input other than enter so i guess i dont have one or one was generated idk edit managed to change my private ssh keys passphrase when trying to change the public one it gives bad permissions error i have two files in my ssh folder ided25519 and ided25519pub and on gitlab my ssh key is registered but i dont understand whats stopping me from pushing my git testing rep to gitlab"
  },
  {
    "creation_date": 1643391329,
    "user_id": 5693252,
    "reputation": 17,
    "view_count": 38,
    "title": "How to view GitLab cummulative commit history by user",
    "body": "we just migrated from svn to gitlab and i would like to view all of my commit history across all the projects i worked on spanning over a decade i can see the commit history for individual projects but not all of the projects i worked on in the organization want to view the cumulative commit history does gitlab enterprise edition offer such visibility to a user with a maintainer role if it does can anyone point me how i skimmed through the docs and couple of posts but couldnt find any"
  },
  {
    "creation_date": 1643390276,
    "user_id": 11771565,
    "reputation": 310,
    "view_count": 36,
    "title": "Error refreshing state: Failed to read remote state: unexpected EOF - Terraform State on GitLab",
    "body": "im try configuring gitlab to save terraform state i set my file as below i can run only the first time and the state is saved correctly on my gitlab project under infrastructuregtterraform but it i try to rerun i receive this error note my terraform files are not in the main root project but in a subfolder how can fix my problem"
  },
  {
    "creation_date": 1643381492,
    "user_id": 14129748,
    "reputation": 86,
    "view_count": 10,
    "title": "gitlab runner run in background on Ubuntu startUp",
    "body": "i have a problem gitlab cicd works perfect and changes from repo comes to webserber if i previously connect via ssh to webserver and type i try to add autoload to after restart runner is visible from gitlab admin panel and it is green but if i push to repo changes changes not updated till command is run on webserver"
  },
  {
    "creation_date": 1643375543,
    "user_id": 6608222,
    "reputation": 1396,
    "view_count": 36,
    "title": "Deploy gitlab pages using downstream stage",
    "body": "this is my folder tree as you can see there are two files the first in the root of the project is the pipeline that trigger the second one into the folder i would like that the first pipeline in addition to deploy the application only on a specific branch trigger the second pipeline and deploy the documentation on this is the code of the and this is is the in the projects root the pipeline trigger correctly the downstream but its fail so how can i pass the public folder to the downstream and why the secondary doesnt see the folder"
  },
  {
    "creation_date": 1643367687,
    "user_id": 2239784,
    "reputation": 710,
    "view_count": 43,
    "title": "Possible to run a single stage of my pipeline on a schedule?",
    "body": "im pretty new to gitlab ci and havent been able to find an answer for this yet i have my basic pipeline that runs unit tests does some db checks builds an image deploys to qa runs some functional tests then deploys to production this codebase doesnt change much so we dont run tests every day week but changes from other teams can affect this project is it possible to just run the functional test stage of the pipeline on a schedule without rebuilding and deploying to qa all of those steps before the test run require manual approval so even if we did just deploy to qa every day it would still require manual interaction"
  },
  {
    "creation_date": 1643365654,
    "user_id": 11621071,
    "reputation": 148,
    "view_count": 16,
    "title": "GitLab private maven repository not working in Spring Cloud Data Flow",
    "body": "im trying to register a task from my gitlab private maven repository i launch spring cloud dataflow and skipper with these properties so i register the app as when i trying to launch a task it cant be resolved saying it seems that scdf try to download the maven package only from springrepo and not from gitlab am i missing something"
  },
  {
    "creation_date": 1643365322,
    "user_id": 1983854,
    "reputation": 245036,
    "view_count": 25,
    "title": "How can I assign an issue to a milestone automatically using templates?",
    "body": "i am using gitlab issue templates and they work well for example i have this one in when i use it it shows the headers and it also labels the issue as confidential as described in the gitlab quick actions free doc command issue merge request epic action checkcircle yes dottedcircle no dottedcircle no make confidential checkcircle yes checkcircle yes checkcircle yes add one or more labels label names can also start without a tilde but mixed syntax is not supported checkcircle yes checkcircle yes dottedcircle no set milestone however the piece that does not work is the one that should the milestone foo with the id 15 i refer to how can i assign a milestone with the name foo automatically shouldnt suffice"
  },
  {
    "creation_date": 1643365140,
    "user_id": 18056092,
    "reputation": 13,
    "view_count": 31,
    "title": "Gitlab multiple folders rule",
    "body": "are there ways to merge row changes of multiple folders into a single row for instance combine to the 1 line in short i want to list all folders in the root directory by one line to avoid bulky part in changes"
  },
  {
    "creation_date": 1643346759,
    "user_id": 14507451,
    "reputation": 31,
    "view_count": 23,
    "title": "GITLAB Warning - &#39;NO NSA Protected Information Allowed&#39; reason?",
    "body": "from past two weeks i am getting this warning message on top of my gitlab account no nsa protected information allowed i have tried to find the reason of it all over google and gitlab but havent got anything please let me know if this is something i should worry about"
  },
  {
    "creation_date": 1643326216,
    "user_id": 273924,
    "reputation": 5337,
    "view_count": 30,
    "title": "Why is GitLab CI SAST not exluding directories that I ask it to exclude?",
    "body": "i have enabled sast scanning in gitlab ci gitlab community edition 1452 the sast runs tools like semgrep and eslint run over the source code and scan for vulnerabilities this works except its not excluding paths and files from the results that i tell it to so my reports are filled with junk from 3rd party libs since i dont want test code or 3rd party stuff in the report i use the gitlab provided variable for this purpose called that i use to exclude some dirs my value is like this so basically in addition to the default paths ive told it not to scan or so the simplified gitlabciyml that adds the step adds the exclusions and also sets to the latter so i can see the debug output of stages such as sastsemgrep i can see from the debug that sastsemgrep is taking my exclusions and turning them into arguments but it just scans the paths anyway i have even tried appending glob rules onto the paths eg serverlibs i have even tried using absolute paths eg ciprojectdirserverlibs but that doesnt work either i have enabled debug console output and i can even see tools like semgrep are correctly expanding out the exclusions but it doesnt work this example includes a expansion that doesnt make any difference as far as i can tell im using the latest gitlab and docker images that gitlab invokes does anyone know why exclusion isnt working am i missing something obvious fyi i have also tried the same cicd script in gitlab ultimate evaluation copy and its the same deal so its not to do with the less powerful sast functionality in the community edition which should still produce a json report any ideas"
  },
  {
    "creation_date": 1643322797,
    "user_id": 15173118,
    "reputation": 15,
    "view_count": 48,
    "title": "Included file does not have a valid YAML syntax",
    "body": "i am including a remote gitlabciyml file but checking for it yaml syntax in ci lint gui its saying included file httpsgitlabcompaulblartpaultestmaingitlabciyml does not have valid yaml syntax but upon checking the syntax of gitlabciyml of the remote file its valid i am not sure whats going on"
  }
]