[
    {
        "type": "usability",
        "question": "How do I format questions better?",
        "answer": "The new WYSIWYG editor has made writing Markdown in your wiki easier than ever. However, the toolbar's position in the editor made formatting text on longer pages tedious and repetitive.<br><br>In GitLab 14.2, the most frequently used formatting options (bold, italic, strikethrough, and code) display in a floating menu above your text selection. By limiting the distance you have to move your cursor while formatting, you can work more efficiently. Spend more time focusing on your content, and less on scrolling up and down the page."
    },
    {
        "type": "security",
        "question": "What's new in SAST Go analyzer updated to support Go 1.16?",
        "answer": "We have updated our Static Application Security Testing (SAST) Go analyzer, GoSec, to support Go 1.16. This update introduces support for Go projects requiring this version of Go but also limits GOPATH shimming to only projects without Go modules. Should you require GOPATH shimming you can now pin to a minor version of an analyzer using GoSec version 3.1.3. Pinning to a previous version will prevent you from receiving automatic analyzer updates and require you to manually bump your analyzer version in your CI template."
    },
    {
        "type": "ops",
        "question": "How do I email specific users in an escalation policy?",
        "answer": "When creating the escalation policy for alerts, it's useful to email a specific user in addition to the on-call user. In this release, we added the ability for teams to define the user to contact, even if that user isn't part of the on-call rotation."
    },
    {
        "type": "usability",
        "question": "How do I add pronunciation to user profile page?",
        "answer": "You can now add pronunciation to your user profile. In distributed teams where team members are from different countries, it can be difficult to determine how to say someone's name correctly. This will help others know how to pronounce your name."
    },
    {
        "type": "security",
        "question": "How do I hide application secrets?",
        "answer": "Previously, the Secret field was visible in the GitLab UI on an application's configuration page. To improve security, we have hidden this field from the UI and added a Copy button. You can then copy the secret and store it in a secured location. This makes sure the secret is not visible in clear text for anyone looking at the screen."
    },
    {
        "type": "usability",
        "question": "How do I launch a preconfigured Gitpod workspace from a merge request?",
        "answer": "The Gitpod integration, introduced in GitLab 13.5, helps you manage your complicated development environments. Once you define your project's configuration in code, you can launch a prebuilt, cloud-based development environment with a single click. This convenient workflow has made it faster than ever to generate new changes, but launching a Gitpod environment to review an existing merge request meant building an environment against the main branch before switching to the target branch and building again."
    },
    {
        "type": "ops",
        "question": "How do I show pipeline ID in the pipelines page?",
        "answer": "The pipeline IID gives the internal ID of a pipeline relative to the project that triggered it, and it increments for every new pipeline in the project. The pipeline IID increments much slower than the pipeline ID, which increments by one for every pipeline in the whole GitLab instance. This makes the pipeline IID a more useful value for use cases like versioning project releases based on pipelines, tracking pipelines based on their run order in the project, project pipeline metrics, etc."
    },
    {
        "type": "usability",
        "question": "How do I preview markdown live while editing?",
        "answer": "Markdown is a fast and intuitive syntax for writing rich web content. Until it isn't. Luckily, it's easy to preview the rendered output of Markdown to ensure the accuracy of your markup from the Preview tab. Unfortunately, the context switch required to move between the raw source code and the preview can be tedious and disruptive to your flow."
    },
    {
        "type": "usability",
        "question": "How do I create tables and upload images in the Wiki Content Editor?",
        "answer": "We began improving your wiki editing experience in GitLab 14.0, when we introduced the MVC of a new WYSIWYG Markdown editor. It supported the most common Markdown formatting options, but with some notable gaps. GitLab 14.1 continues to improve your editing experience for images and tables. You can now upload images directly into the editor. You can also insert and edit tables, including copying and pasting content from popular spreadsheet applications to bring tables from other sources into your wiki."
    }
]
