module gitlab.com/gitlab-da/use-cases/ai/ai-workshops/gitlab-duo-ai-eddie-jaoude/go-hello-duo

go 1.21.7

require (
	github.com/beorn7/perks v1.0.1 // indirect
	github.com/cespare/xxhash/v2 v2.2.0 // indirect
	github.com/prometheus/client_golang v1.19.0 // indirect
	github.com/prometheus/client_model v0.5.0 // indirect
	github.com/prometheus/common v0.48.0 // indirect
	github.com/prometheus/procfs v0.12.0 // indirect
	golang.org/x/net v0.25.0 // indirect
	golang.org/x/sys v0.20.0 // indirect
	google.golang.org/protobuf v1.32.0 // indirect
)
