<svg width="122" height="52" viewBox="0 0 122 52" fill="none" xmlns="http://www.w3.org/2000/svg">
<path d="M39.4486 31.3754L39.9681 34.2184C40.1381 35.144 40.8654 35.8619 41.7816 36.0319L44.6246 36.5514C45.1251 36.6458 45.1251 37.3636 44.6246 37.4486L41.7816 37.9681C40.856 38.1381 40.1381 38.8654 39.9681 39.7816L39.4486 42.6246C39.3542 43.1251 38.6364 43.1251 38.5514 42.6246L38.0319 39.7816C37.8619 38.856 37.1346 38.1381 36.2184 37.9681L33.3754 37.4486C32.8749 37.3542 32.8749 36.6364 33.3754 36.5514L36.2184 36.0319C37.144 35.8619 37.8619 35.1346 38.0319 34.2184L38.5514 31.3754C38.6458 30.8749 39.3636 30.8749 39.4486 31.3754Z" fill="url(#paint0_linear_288_1364)"/>
<g clip-path="url(#clip0_288_1364)">
<path d="M16.9999 23C8.15146 23 1 15.8485 1 7C1 -1.84849 8.15146 -9 16.9999 -9C25.8483 -9 32.9998 -1.84849 32.9998 7C33.0402 15.8081 25.8483 23 16.9999 23Z" fill="url(#paint1_linear_288_1364)"/>
</g>
<path d="M113.527 58H81.473C76.8106 58 73 53.9731 73 49C73 44.0269 76.7882 40 81.473 40H113.527C118.212 40 122 44.0269 122 49C122 53.9731 118.212 58 113.527 58Z" fill="url(#paint2_linear_288_1364)"/>
<path d="M91.8157 44H60.1843C55.6719 44 52 39.9925 52 35C52 30.0298 55.6719 26 60.1843 26H91.8157C96.3281 26 100 30.0075 100 35C100 39.9925 96.3281 44 91.8157 44Z" stroke="url(#paint3_linear_288_1364)"/>
<defs>
<linearGradient id="paint0_linear_288_1364" x1="35.8973" y1="40.1122" x2="42.1027" y2="33.9067" gradientUnits="userSpaceOnUse">
<stop offset="0.33" stop-color="#10AEAE" stop-opacity="0.61"/>
<stop offset="0.43" stop-color="#1CB3B1" stop-opacity="0.66"/>
<stop offset="0.63" stop-color="#3BC0B9" stop-opacity="0.79"/>
<stop offset="0.91" stop-color="#6FD7C6"/>
</linearGradient>
<linearGradient id="paint1_linear_288_1364" x1="33.0222" y1="6.9756" x2="1.01103" y2="6.9756" gradientUnits="userSpaceOnUse">
<stop stop-color="#FCA326"/>
<stop offset="1" stop-color="#A989F5"/>
</linearGradient>
<linearGradient id="paint2_linear_288_1364" x1="73.0134" y1="48.9964" x2="121.991" y2="48.9964" gradientUnits="userSpaceOnUse">
<stop stop-color="#5943B6"/>
<stop offset="1" stop-color="#A989F5"/>
</linearGradient>
<linearGradient id="paint3_linear_288_1364" x1="100.164" y1="35.0131" x2="51.8339" y2="35.0131" gradientUnits="userSpaceOnUse">
<stop stop-color="#7759C2"/>
<stop offset="0.9561" stop-color="#232150"/>
</linearGradient>
<clipPath id="clip0_288_1364">
<rect width="32" height="26" fill="white" transform="matrix(-1 0 0 1 33 0)"/>
</clipPath>
</defs>
</svg>
