<svg width="15" height="16" viewBox="0 0 15 16" fill="none" xmlns="http://www.w3.org/2000/svg">
<path id="Vector" d="M6.60899 1.08076L5.99055 4.57815C5.78815 5.71684 4.92233 6.59991 3.83162 6.80905L0.447042 7.44811C-0.148912 7.5643 -0.148912 8.44737 0.447042 8.55194L3.83162 9.191C4.93357 9.40015 5.78815 10.2948 5.99055 11.4219L6.60899 14.9193C6.72144 15.5351 7.57601 15.5351 7.67721 14.9193L8.29566 11.4219C8.49806 10.2832 9.36388 9.40015 10.4546 9.191L13.8392 8.55194C14.4351 8.43575 14.4351 7.55268 13.8392 7.44811L10.4546 6.80905C9.35264 6.59991 8.49806 5.70522 8.29566 4.57815L7.67721 1.08076C7.56477 0.464941 6.71019 0.464941 6.60899 1.08076Z" fill="#171321"/>
</svg>
