<svg width="48" height="48" viewBox="0 0 48 48" fill="none" xmlns="http://www.w3.org/2000/svg">
<path d="M4.89848 8.03516C5.32568 21.3216 3.67928 26.5535 7.06808 33.5999C9.46808 38.5871 17.6281 44.7647 23.9977 47.0399" stroke="#7759C2" stroke-width="1.27982" stroke-linecap="round" stroke-linejoin="round"/>
<path d="M8.01758 8.21756C11.0357 8.16435 14.0108 7.49286 16.7592 6.24457C19.5076 4.99628 21.9709 3.1977 23.9968 0.959961C26.3762 3.58886 29.3549 5.60475 32.6799 6.83649C36.0049 8.06822 39.5781 8.47942 43.096 8.03516C42.6688 21.3216 44.3152 26.5536 40.9264 33.6C38.5264 38.5872 30.3664 44.7648 23.9968 47.04" stroke="#7759C2" stroke-width="1.27982" stroke-linecap="round" stroke-linejoin="round"/>
<path d="M32.6414 19.3678L30.4622 17.1886C30.3422 17.0676 30.1993 16.9715 30.042 16.906C29.8846 16.8404 29.7159 16.8066 29.5454 16.8066C29.3749 16.8066 29.2062 16.8404 29.0488 16.906C28.8914 16.9715 28.7486 17.0676 28.6286 17.1886L21.9422 23.8558L19.3982 21.307C19.1545 21.0649 18.8249 20.929 18.4814 20.929C18.1379 20.929 17.8083 21.0649 17.5646 21.307L15.3854 23.491C15.1436 23.7339 15.0078 24.0627 15.0078 24.4054C15.0078 24.7482 15.1436 25.0769 15.3854 25.3198L20.4734 30.4078C20.666 30.6004 20.8946 30.7532 21.1462 30.8574C21.3978 30.9617 21.6675 31.0153 21.9398 31.0153C22.2121 31.0153 22.4818 30.9617 22.7334 30.8574C22.985 30.7532 23.2136 30.6004 23.4062 30.4078L32.6414 21.1966C32.7623 21.077 32.8583 20.9346 32.9238 20.7776C32.9893 20.6207 33.023 20.4523 33.023 20.2822C33.023 20.1122 32.9893 19.9438 32.9238 19.7868C32.8583 19.6299 32.7623 19.4874 32.6414 19.3678V19.3678Z" stroke="#7759C2" stroke-width="1.27982" stroke-linecap="round" stroke-linejoin="round"/>
</svg>
