<svg width="163" height="265" viewBox="0 0 163 265" fill="none" xmlns="http://www.w3.org/2000/svg">
<path d="M86.4464 76.9618H63.9926L58.2907 81.3421C56.65 80.4044 54.8832 79.6717 53.0182 79.1634L52.0821 72.0293H41.984L41.048 79.1634C39.1813 79.6717 37.4109 80.4061 35.7668 81.3474L30.0736 76.9618L22.9343 84.1011L27.3199 89.7943C26.3769 91.4419 25.6423 93.2158 25.1323 95.0878L18 96.0116V106.11L25.1323 107.033C25.6406 108.905 26.3769 110.679 27.3199 112.327L22.9343 118.02L30.0736 125.159L35.7668 120.774C37.4127 121.717 39.1866 122.451 41.0586 122.961L41.956 130.094H52.0821L53.0058 122.961C54.8744 122.453 56.6465 121.722 58.2889 120.781L63.9909 125.161H79.2826M47.0322 111.16C41.4565 111.16 36.9341 106.637 36.9341 101.062C36.9341 95.4857 41.4565 90.9634 47.0322 90.9634C52.608 90.9634 57.1303 95.4857 57.1303 101.062C57.1303 106.637 52.608 111.16 47.0322 111.16Z" stroke="#2F2A6B" stroke-width="1.40227" stroke-miterlimit="10"/>
<path d="M63.8398 90.0811H77.8923" stroke="#2F2A6B" stroke-width="1.40227" stroke-miterlimit="10"/>
<path d="M66.5801 101.037H76.0103C77.8455 101.037 79.5983 101.801 80.8463 103.146L84.0523 106.599C85.3003 107.943 87.0532 108.708 88.8884 108.708H95.5666" stroke="#2F2A6B" stroke-width="1.40227" stroke-miterlimit="10"/>
<path d="M64.1133 111.996H75.1982" stroke="#2F2A6B" stroke-width="1.40227" stroke-miterlimit="10"/>
<path d="M77.6188 92.2708C78.8289 92.2708 79.8098 91.2898 79.8098 90.0797C79.8098 88.8696 78.8289 87.8887 77.6188 87.8887C76.4087 87.8887 75.4277 88.8696 75.4277 90.0797C75.4277 91.2898 76.4087 92.2708 77.6188 92.2708Z" fill="#2F2A6B"/>
<path d="M86.4469 79.0793C87.657 79.0793 88.6379 78.0984 88.6379 76.8883C88.6379 75.6782 87.657 74.6973 86.4469 74.6973C85.2368 74.6973 84.2559 75.6782 84.2559 76.8883C84.2559 78.0984 85.2368 79.0793 86.4469 79.0793Z" fill="#2F2A6B"/>
<path d="M75.1989 114.187C76.4089 114.187 77.3899 113.206 77.3899 111.996C77.3899 110.786 76.4089 109.805 75.1989 109.805C73.9888 109.805 73.0078 110.786 73.0078 111.996C73.0078 113.206 73.9888 114.187 75.1989 114.187Z" fill="#2F2A6B"/>
<path d="M81.2506 127.337C82.4607 127.337 83.4417 126.356 83.4417 125.146C83.4417 123.936 82.4607 122.955 81.2506 122.955C80.0405 122.955 79.0596 123.936 79.0596 125.146C79.0596 126.356 80.0405 127.337 81.2506 127.337Z" fill="#2F2A6B"/>
<path d="M97.4821 110.899C98.6921 110.899 99.6731 109.918 99.6731 108.708C99.6731 107.498 98.6921 106.517 97.4821 106.517C96.272 106.517 95.291 107.498 95.291 108.708C95.291 109.918 96.272 110.899 97.4821 110.899Z" fill="#2F2A6B"/>
<path d="M76.0835 105.996V96.0805L68.8969 95.0235C68.3938 93.1918 67.6664 91.4529 66.7461 89.8368L71.0844 84.0104L64.0731 76.9991L58.2432 81.3356C56.6253 80.4154 54.8865 79.6879 53.0513 79.1849L52.0048 72H42.089L41.0373 79.1849C39.2021 79.6879 37.4598 80.4171 35.8419 81.3391L30.0191 76.9973L23.0077 84.0087L27.346 89.8351C26.424 91.4529 25.6966 93.1953 25.1917 95.0305L18.0068 96.0769V105.993L25.1917 107.044C25.6948 108.88 26.424 110.622 27.346 112.24L23.0042 118.063L30.0155 125.074L35.8419 120.736C37.4598 121.658 39.1986 122.385 41.0338 122.888L42.0855 130.073H52.0013L53.0583 122.887C54.8918 122.383 56.6288 121.656 58.2449 120.736L64.0714 125.074L71.0827 118.063L66.7461 112.233C67.6664 110.617 68.3938 108.878 68.8969 107.046L76.0835 105.994V105.996ZM47.046 110.306C41.9277 110.306 37.7789 106.157 37.7789 101.039C37.7789 95.9209 41.9277 91.772 47.046 91.772C52.1643 91.772 56.3133 95.9209 56.3133 101.039C56.3133 106.157 52.1643 110.306 47.046 110.306Z" fill="#2F2A6B"/>
<circle cx="48" cy="100" r="57.5" stroke="#6FDAC9" stroke-opacity="0.5"/>
<circle cx="48" cy="100" r="87.5" stroke="#6FDAC9" stroke-opacity="0.3"/>
<circle cx="48" cy="100" r="114.5" stroke="#6FDAC9" stroke-opacity="0.1"/>
</svg>
