<svg width="16" height="16" viewBox="0 0 16 16" fill="none" xmlns="http://www.w3.org/2000/svg">
<path id="Vector" d="M0.464691 8.61748L4.25513 9.30762C5.4943 9.52555 6.5148 10.4699 6.66058 11.7049L7.35307 15.4824C7.49886 16.1725 8.44647 16.1725 8.59226 15.4824L9.28475 11.7049C9.50343 10.4699 10.451 9.52555 11.6902 9.30762L15.4806 8.61748C16.1731 8.47219 16.1731 7.5278 15.4806 7.38252L11.6902 6.69238C10.451 6.47445 9.43053 5.53008 9.28475 4.29512L8.59226 0.517592C8.44647 -0.172531 7.49886 -0.172531 7.35307 0.517592L6.66058 4.29512C6.4419 5.53008 5.4943 6.54709 4.25513 6.69238L0.464691 7.38252C-0.154898 7.52781 -0.154898 8.43587 0.464691 8.61748Z" fill="url(#paint0_linear_52_2733)"/>
<defs>
<linearGradient id="paint0_linear_52_2733" x1="-8.99999" y1="0.0606512" x2="159.614" y2="-104.391" gradientUnits="userSpaceOnUse">
<stop stop-color="#F7A20F"/>
<stop offset="0.346441" stop-color="#A989F5"/>
<stop offset="0.66564" stop-color="#962EFF"/>
<stop offset="1" stop-color="#0099FF"/>
</linearGradient>
</defs>
</svg>
