<svg width="12" height="7" viewBox="0 0 12 7" fill="none" xmlns="http://www.w3.org/2000/svg">
<path d="M10.2929 0.292894C10.6834 -0.0976306 11.3166 -0.0976306 11.7071 0.292894C12.0976 0.683418 12.0976 1.31658 11.7071 1.70711L6.70711 6.70711C6.31658 7.09763 5.68342 7.09763 5.29289 6.70711L0.292894 1.70711C-0.0976312 1.31658 -0.0976312 0.683417 0.292894 0.292893C0.683418 -0.0976311 1.31658 -0.0976311 1.70711 0.292893L6 4.58579L10.2929 0.292894Z" fill="#333333"/>
</svg>
