<svg width="34" height="39" viewBox="0 0 34 39" fill="none" xmlns="http://www.w3.org/2000/svg">
<path d="M0.999609 10.3052V19.2732C0.999609 24.8412 3.43161 29.8892 7.69961 33.4812C9.95561 35.3812 12.9676 36.7612 16.9996 38.1772C21.0316 36.7612 24.0436 35.3812 26.2996 33.4812C30.5676 29.8892 32.9996 24.8412 32.9996 19.2732V7.10917C22.1396 7.29317 16.9996 0.977173 16.9996 0.977173C16.9996 0.977173 11.8596 7.29317 0.999609 7.10917H0.599609" stroke="#171321" stroke-width="0.8" stroke-miterlimit="10"/>
<path d="M11 20.2731L14.6 23.8731L23.4 15.0731" stroke="#171321" stroke-width="0.8" stroke-miterlimit="10"/>
</svg>
