<svg width="601" height="143" viewBox="0 0 601 143" fill="none" xmlns="http://www.w3.org/2000/svg">
<g clip-path="url(#clip0_650_24294)">
<path d="M206.5 132.4L204.5 128.3H193.1V121H204.2V117H193.1V110.2H204.4L206.4 106.2H188.4V132.4H206.5ZM171 132.4V110.2H177.2L179 106.2H158.5V110.2H166.4V132.4H171ZM253.5 132.4V106.2H248.9V116.9H235.2V106.2H230.6V132.4H235.2V121H248.9V132.5H253.5V132.4ZM283.7 132.4L281.7 128.4H270.4V121.1H281.5V117.1H270.4V110.3H281.7L283.7 106.3H265.7V132.5H283.7V132.4ZM314.9 132.4L308.5 122.1C311.6 121.6 314.7 119.1 314.7 114.4C314.7 109.6 311.3 106.2 306.1 106.2H294.6V132.4H299.2V122.6H303.8L309.6 132.4H314.9ZM305.5 118.6H299.2V110.3H305.5C308.1 110.3 310 112 310 114.5C310 116.9 308.1 118.6 305.5 118.6ZM344.5 132.4L342.5 128.4H331.2V121.1H342.3V117.1H331.2V110.3H342.5L344.5 106.3H326.5V132.5H344.5V132.4ZM379.7 132.4V106.2H375.1V124.4L361.7 106.2H357V132.4H361.6V113.7L375.3 132.4H379.7ZM413.2 109.9C411.1 107.6 408.1 105.8 403.8 105.8C396.2 105.8 390 111.1 390 119.4C390 127.7 396.2 133 403.8 133C408.4 133 412 131.1 414.6 128.3V118.5H404.1V122.5H410V126.6C408.8 127.7 406.5 129 403.8 129C398.6 129 394.8 125 394.8 119.5C394.8 114 398.7 110 403.8 110C406.5 110 408.8 111.3 410.2 113L413.2 109.9ZM450.8 132.4L440.5 106.2H434.8L424.5 132.4H429.7L431.6 127.4H443.6L445.5 132.4H450.8ZM442.3 123.3H432.9L437.6 110.8L442.3 123.3ZM496.7 132.4L503.3 106.2H498.1L493.9 125.9L488.5 106.2H484.8L479.4 125.9L475.2 106.2H470.1L476.7 132.4H481.6L486.7 113L491.8 132.4H496.7ZM535.5 132.4L525.2 106.2H519.5L509.2 132.4H514.4L516.3 127.4H528.3L530.2 132.4H535.5ZM527.1 123.3H517.7L522.4 110.8L527.1 123.3ZM565.8 132.4L554.4 118.6L565.1 106.2H559.4L549.1 118.7V106.2H544.5V132.4H549.1V124L551.4 121.3L560.2 132.4H565.8ZM599.3 132.4L589 106.2H583.3L573 132.4H578.2L580.1 127.4H592.1L594 132.4H599.3ZM590.9 123.3H581.5L586.2 110.8L590.9 123.3ZM600.6 88.7V41H590.4V71L568.2 41H557.7V88.7H567.9V57.6L590.8 88.7H600.6ZM206.9 88.3999L218.6 40.7H207.1L200.7 74.1L191.6 40.7H183.6L174.5 74.1L168.1 40.7H156.7L168.4 88.3999H179.3L187.7 55.7L196.1 88.3999H206.9ZM260.1 88.7999L256.2 79.8999H236.4V69H255.7V60.1H236.4V50H256.2L260.1 41.1H226.1V88.7999H260.1ZM456 47.7C452.2 43.4 446.5 40 438.3 40C424.1 40 412.5 49.6999 412.5 64.8999C412.5 79.9999 423 89.8999 437.1 89.8999C445.9 89.8999 453.9 86.2999 458.8 80.7999V62.2999H437.7V71.2H448.5V77C446.5 78.8 442.5 80.7 438.2 80.7C429.4 80.7 423 73.9999 423 64.8999C423 55.7999 429.4 49.1 438.2 49.1C442.9 49.1 446.7 51.6 449 54.6L456 47.7ZM524.9 89.6C539.4 89.6 550.5 79.2999 550.5 64.8999C550.5 50.4999 539.9 40.2 525.4 40.2C510.9 40.2 500.4 50.4999 500.4 64.8999C500.3 79.2999 510.4 89.6 524.9 89.6ZM525.4 80.6C516.6 80.6 510.9 73.8 510.9 65C510.9 56.1 516.6 49.3999 525.4 49.3999C534.2 49.3999 540 55.9999 540 64.8999C540 73.7999 534.2 80.6 525.4 80.6ZM485.8 88.7V50H497.8L501.7 41.1H461.5V50H475.5V88.7H485.8ZM341.4 41H351.6V88.7H341.4V41ZM296.4 88.7V79.7999H278.3V41H268.1V88.7H296.4ZM333.1 88.7V79.7999H315V41H304.8V88.7H333.1ZM405 88.7V41H394.8V71L372.6 41H362.1V88.7H372.3V57.6L395.2 88.7H405ZM246.1 25.3C252.1 25.3 256.4 20.8999 256.4 14.8999C256.4 8.89995 252.2 4.49995 246.1 4.49995C240 4.49995 235.8 8.89995 235.8 14.8999C235.8 20.8999 240.1 25.3 246.1 25.3ZM246.1 22.2C242 22.2 239.4 19.0999 239.4 14.8999C239.4 10.7999 242 7.59996 246.1 7.59996C250.1 7.59996 252.8 10.6999 252.8 14.8999C252.8 19.0999 250.2 22.2 246.1 22.2ZM169.1 25L176.3 4.89995H172.3L166.9 21.2L161.5 4.89995H157.5L164.7 25H169.1ZM317.1 25L309.2 4.89995H304.8L297 25H301L302.5 21.1H311.7L313.2 25H317.1ZM310.6 18H303.4L307 8.39995L310.6 18ZM183.4 4.89995H186.9V25H183.4V4.89995ZM209.1 10.2L211.5 7.79996C210 5.99996 207.7 4.59996 204.4 4.59996C198.5 4.59996 193.9 8.79995 193.9 15C193.9 21.2 198.5 25.3999 204.4 25.3999C207.7 25.3999 209.9 24 211.5 22.2L209.1 19.8C208.1 21.2 206.3 22.3 204.4 22.3C200.4 22.3 197.5 19.3 197.5 15C197.5 10.7 200.5 7.69995 204.4 7.69995C206.4 7.69995 208.1 8.69995 209.1 10.2ZM226.2 25V7.99995H231L232.3 4.89995H216.6V7.99995H222.7V25H226.2ZM278.7 25L273.8 17.1C276.2 16.7 278.6 14.8 278.6 11.2C278.6 7.49995 276 4.89995 272 4.89995H263.2V25H266.7V17.5H270.2L274.7 25H278.7ZM271.5 14.3999H266.7V7.99995H271.5C273.5 7.99995 274.9 9.29995 274.9 11.2C275 13.1 273.5 14.3999 271.5 14.3999ZM286.7 4.89995H290.2V25H286.7V4.89995ZM343.3 25.3C349.1 25.3 352 22 352 17V4.89995H348.4V16.8999C348.4 20.0999 346.6 22.2 343.3 22.2C339.9 22.2 338.2 20.0999 338.2 16.8999V4.89995H334.6V17C334.6 22 337.5 25.3 343.3 25.3ZM377.9 25V4.89995H374.4V18.8L364.1 4.89995H360.5V25H364V10.7L374.5 25H377.9ZM387.2 4.89995H390.7V25H387.2V4.89995ZM410.1 25L417.3 4.89995H413.3L407.9 21.2L402.5 4.89995H398.5L405.7 25H410.1ZM438.9 25L437.3 21.8999H428.6V16.3H437.1V13.2H428.6V7.99995H437.3L438.9 4.89995H425.2V25H438.9ZM462.9 25L458 17.1C460.4 16.7 462.8 14.8 462.8 11.2C462.8 7.49995 460.2 4.89995 456.2 4.89995H447.4V25H450.9V17.5H454.4L458.9 25C458.8 25 462.9 25 462.9 25ZM455.7 14.3999H450.9V7.99995H455.7C457.7 7.99995 459.1 9.29995 459.1 11.2C459.1 13.1 457.7 14.3999 455.7 14.3999ZM482.8 9.69995L485.1 7.29996C483.2 5.49996 480.7 4.49995 477.6 4.49995C473.2 4.49995 470.3 7.09995 470.3 10.3999C470.3 17.7999 482 15.1999 482 19.3999C482 20.6999 480.9 22.1 478 22.1C475.4 22.1 473.4 21 472 19.7L469.7 22L469.6 22.1C471.4 24 474.1 25.3 477.8 25.3C483.2 25.3 485.6 22.4 485.6 19.1C485.6 11.6 473.9 13.9 473.9 10.2C473.9 8.69995 475.2 7.69995 477.3 7.69995C479.3 7.69995 481.3 8.39995 482.8 9.69995ZM493.9 4.89995H497.4V25H493.9V4.89995ZM514.6 25V7.99995H519.4L520.7 4.89995H505V7.99995H511.1V25H514.6ZM536 25V16.7L543.1 4.99995H539.1L534.3 13.6L529.5 4.99995H525.5L532.6 16.7V25H536ZM567.8 25.3C573.8 25.3 578.1 20.8999 578.1 14.8999C578.1 8.89995 573.9 4.49995 567.8 4.49995C561.8 4.49995 557.5 8.89995 557.5 14.8999C557.6 20.8999 561.8 25.3 567.8 25.3ZM567.8 22.2C563.7 22.2 561.1 19.0999 561.1 14.8999C561.1 10.7999 563.7 7.59996 567.8 7.59996C571.8 7.59996 574.5 10.6999 574.5 14.8999C574.5 19.0999 571.9 22.2 567.8 22.2ZM589.5 25V16.3H597.9V13.2H589.5V7.99995H598.2L599.8 4.89995H586V25H589.5ZM22.8001 101.4C28.7001 101.3 31.3001 96.9999 37.1001 96.8999C43.4001 96.7999 46.3001 101.5 52.6001 101.5C58.9001 101.5 61.8001 96.8999 68.1001 96.8999C74.4001 96.8999 77.3001 101.5 83.6001 101.5C89.9001 101.5 92.8001 96.7999 99.1001 96.8999C105 96.9999 107.5 101.4 113.4 101.4C113.4 101.4 113.4 101.4 113.5 101.4C99.6001 116.5 76.6001 128.6 68.1001 132.3C61.4001 129.6 36.0001 117.1 21.2001 101C21.6001 101.2 22.2001 101.4 22.8001 101.4ZM116.6 71.6L101.1 87.2L85.6001 71.6H116.6ZM69.1001 53.7999H100.1L84.6001 69.3999C84.6001 69.4999 69.1001 53.7999 69.1001 53.7999ZM83.6001 71.6L68.1001 87.2L52.6001 71.6H83.6001ZM52.6001 36.1H83.6001L68.1001 51.7C68.1001 51.8 52.6001 36.1 52.6001 36.1ZM50.5001 71.6L35.0001 87.2L19.5001 71.6H50.5001ZM36.1001 53.7999H67.1001L51.6001 69.3999C51.5001 69.4999 36.1001 53.7999 36.1001 53.7999ZM124.6 10.2V26.3H10.1001V10.2H124.6ZM0.600098 0.699951V78.5C0.600098 113.6 61.4001 140.6 67.0001 142.1L68.5001 142.5L69.9001 141.9C70.5001 141.6 134.1 114.1 134.1 78.5V0.699951H0.600098Z" fill="#115737"/>
</g>
<defs>
<clipPath id="clip0_650_24294">
<rect width="601" height="143" fill="white"/>
</clipPath>
</defs>
</svg>
