<svg width="135" height="108" viewBox="0 0 135 108" fill="none" xmlns="http://www.w3.org/2000/svg">
<path d="M58.42 14.9375H106.05" stroke="#2F2A6B" stroke-width="2.2" stroke-miterlimit="10"/>
<path d="M29.55 107.137C34.77 107.137 39 102.907 39 97.6873C39 92.4673 34.77 88.2373 29.55 88.2373C24.33 88.2373 20.1 92.4673 20.1 97.6873C20.1 102.907 24.33 107.137 29.55 107.137Z" fill="#EE6D26"/>
<path d="M44.25 0.357422H14.58C6.53 0.357422 0 6.88742 0 14.9374C0 22.9874 6.53 29.5174 14.58 29.5174H44.25C52.3 29.5174 58.83 22.9874 58.83 14.9374C58.83 6.88742 52.3 0.357422 44.25 0.357422Z" fill="#7759B4"/>
<path d="M28.23 9.22738L23.66 13.7974C23.03 14.4274 23.03 15.4474 23.66 16.0774L28.23 20.6474C28.86 21.2774 29.88 21.2774 30.51 20.6474L35.08 16.0774C35.71 15.4474 35.71 14.4274 35.08 13.7974L30.51 9.22738C29.88 8.59738 28.86 8.59738 28.23 9.22738Z" fill="white"/>
<path d="M30.65 88.5176H28.45V81.5176H30.65V88.5176ZM30.65 75.5176H28.45V68.5176H30.65V75.5176ZM30.65 62.5176H28.45V55.5176H30.65V62.5176ZM30.65 49.5176H28.45V42.5176H30.65V49.5176ZM30.65 36.5176H28.45V29.5176H30.65V36.5176Z" fill="#2F2A6B"/>
<path d="M115.09 24.3873C120.31 24.3873 124.54 20.1573 124.54 14.9373C124.54 9.71731 120.31 5.4873 115.09 5.4873C109.87 5.4873 105.64 9.71731 105.64 14.9373C105.64 20.1573 109.87 24.3873 115.09 24.3873Z" fill="white" stroke="#6FCEBD" stroke-width="2.2" stroke-miterlimit="10"/>
<path d="M125.09 24.3873C130.31 24.3873 134.54 20.1573 134.54 14.9373C134.54 9.71731 130.31 5.4873 125.09 5.4873C119.87 5.4873 115.64 9.71731 115.64 14.9373C115.64 20.1573 119.87 24.3873 125.09 24.3873Z" fill="#6FCCBB"/>
</svg>
