[
  {
    "rule": "gitlab_base.MeaningfulLinkWords",
    "description": "Improve SEO and accessibility by rewriting the link text for '[here]'.",
    "fingerprint": "content/handbook/engineering/infrastructure-platforms/data-access/gitaly/_index.md-51",
    "severity": "major",
    "location": {
      "path": "content/handbook/engineering/infrastructure-platforms/data-access/gitaly/_index.md",
      "lines": {
        "begin": 51
      }
    },
    "link": "https://docs.gitlab.com/ee/development/documentation/styleguide/index.html#text-for-links"
  },
  {
    "rule": "gitlab_base.LatinTerms",
    "description": "Use 'with', 'through', or 'by using' instead of 'via', but consider rewriting the sentence.",
    "fingerprint": "content/handbook/engineering/infrastructure-platforms/data-access/gitaly/_index.md-77",
    "severity": "major",
    "location": {
      "path": "content/handbook/engineering/infrastructure-platforms/data-access/gitaly/_index.md",
      "lines": {
        "begin": 77
      }
    },
    "link": "https://docs.gitlab.com/ee/development/documentation/styleguide/word_list.html"
  },
  {
    "rule": "gitlab_base.MultiLineLinks",
    "description": "Put the full link on one line, even if the link is very long.",
    "fingerprint": "content/handbook/engineering/infrastructure-platforms/data-access/gitaly/_index.md-87",
    "severity": "blocker",
    "location": {
      "path": "content/handbook/engineering/infrastructure-platforms/data-access/gitaly/_index.md",
      "lines": {
        "begin": 87
      }
    },
    "link": "https://docs.gitlab.com/ee/development/documentation/styleguide/index.html#links"
  },
  {
    "rule": "gitlab_base.MeaningfulLinkWords",
    "description": "Improve SEO and accessibility by rewriting the link text for '[here]'.",
    "fingerprint": "content/handbook/engineering/infrastructure-platforms/data-access/gitaly/_index.md-96",
    "severity": "major",
    "location": {
      "path": "content/handbook/engineering/infrastructure-platforms/data-access/gitaly/_index.md",
      "lines": {
        "begin": 96
      }
    },
    "link": "https://docs.gitlab.com/ee/development/documentation/styleguide/index.html#text-for-links"
  },
  {
    "rule": "handbook.Spelling",
    "description": "Check the spelling of 'deliberatly'. If the spelling is correct, make a MR to add this word to the spelling exceptions list.",
    "fingerprint": "content/handbook/engineering/infrastructure-platforms/data-access/gitaly/_index.md-160",
    "severity": "major",
    "location": {
      "path": "content/handbook/engineering/infrastructure-platforms/data-access/gitaly/_index.md",
      "lines": {
        "begin": 160
      }
    },
    "link": ""
  },
  {
    "rule": "gitlab_base.HeadingDepth",
    "description": "Refactor the section or page to avoid headings greater than H5.",
    "fingerprint": "content/handbook/engineering/infrastructure-platforms/data-access/gitaly/_index.md-190",
    "severity": "info",
    "location": {
      "path": "content/handbook/engineering/infrastructure-platforms/data-access/gitaly/_index.md",
      "lines": {
        "begin": 190
      }
    },
    "link": "https://docs.gitlab.com/ee/development/documentation/styleguide/index.html#heading-levels-in-markdown"
  },
  {
    "rule": "handbook.Spelling",
    "description": "Check the spelling of 'seconary'. If the spelling is correct, make a MR to add this word to the spelling exceptions list.",
    "fingerprint": "content/handbook/engineering/infrastructure-platforms/data-access/gitaly/_index.md-223",
    "severity": "major",
    "location": {
      "path": "content/handbook/engineering/infrastructure-platforms/data-access/gitaly/_index.md",
      "lines": {
        "begin": 223
      }
    },
    "link": ""
  },
  {
    "rule": "handbook.Spelling",
    "description": "Check the spelling of 'ie'. If the spelling is correct, make a MR to add this word to the spelling exceptions list.",
    "fingerprint": "content/handbook/engineering/infrastructure-platforms/data-access/gitaly/_index.md-264",
    "severity": "major",
    "location": {
      "path": "content/handbook/engineering/infrastructure-platforms/data-access/gitaly/_index.md",
      "lines": {
        "begin": 264
      }
    },
    "link": ""
  },
  {
    "rule": "gitlab_base.LatinTerms",
    "description": "Use 'that is' instead of 'ie', but consider rewriting the sentence.",
    "fingerprint": "content/handbook/engineering/infrastructure-platforms/data-access/gitaly/_index.md-264",
    "severity": "major",
    "location": {
      "path": "content/handbook/engineering/infrastructure-platforms/data-access/gitaly/_index.md",
      "lines": {
        "begin": 264
      }
    },
    "link": "https://docs.gitlab.com/ee/development/documentation/styleguide/word_list.html"
  },
  {
    "rule": "gitlab_base.LatinTerms",
    "description": "Use 'that is' instead of 'ie', but consider rewriting the sentence.",
    "fingerprint": "content/handbook/engineering/infrastructure-platforms/data-access/gitaly/_index.md-298",
    "severity": "major",
    "location": {
      "path": "content/handbook/engineering/infrastructure-platforms/data-access/gitaly/_index.md",
      "lines": {
        "begin": 298
      }
    },
    "link": "https://docs.gitlab.com/ee/development/documentation/styleguide/word_list.html"
  },
  {
    "rule": "handbook.Spelling",
    "description": "Check the spelling of 'ie'. If the spelling is correct, make a MR to add this word to the spelling exceptions list.",
    "fingerprint": "content/handbook/engineering/infrastructure-platforms/data-access/gitaly/_index.md-298",
    "severity": "major",
    "location": {
      "path": "content/handbook/engineering/infrastructure-platforms/data-access/gitaly/_index.md",
      "lines": {
        "begin": 298
      }
    },
    "link": ""
  },
  {
    "rule": "handbook.Spelling",
    "description": "Check the spelling of 'workflowready'. If the spelling is correct, make a MR to add this word to the spelling exceptions list.",
    "fingerprint": "content/handbook/engineering/infrastructure-platforms/data-access/gitaly/_index.md-322",
    "severity": "major",
    "location": {
      "path": "content/handbook/engineering/infrastructure-platforms/data-access/gitaly/_index.md",
      "lines": {
        "begin": 322
      }
    },
    "link": ""
  },
  {
    "rule": "handbook.Spelling",
    "description": "Check the spelling of 'Drozdov'. If the spelling is correct, make a MR to add this word to the spelling exceptions list.",
    "fingerprint": "content/handbook/engineering/infrastructure-platforms/data-access/gitaly/_index.md-337",
    "severity": "major",
    "location": {
      "path": "content/handbook/engineering/infrastructure-platforms/data-access/gitaly/_index.md",
      "lines": {
        "begin": 337
      }
    },
    "link": ""
  },
  {
    "rule": "handbook.Spelling",
    "description": "Check the spelling of 'gitaly'. If the spelling is correct, make a MR to add this word to the spelling exceptions list.",
    "fingerprint": "content/handbook/engineering/infrastructure-platforms/data-access/gitaly/_index.md-364",
    "severity": "major",
    "location": {
      "path": "content/handbook/engineering/infrastructure-platforms/data-access/gitaly/_index.md",
      "lines": {
        "begin": 364
      }
    },
    "link": ""
  },
  {
    "rule": "gitlab_base.MeaningfulLinkWords",
    "description": "Improve SEO and accessibility by rewriting the link text for '[here]'.",
    "fingerprint": "content/handbook/engineering/infrastructure-platforms/data-access/gitaly/_index.md-392",
    "severity": "major",
    "location": {
      "path": "content/handbook/engineering/infrastructure-platforms/data-access/gitaly/_index.md",
      "lines": {
        "begin": 392
      }
    },
    "link": "https://docs.gitlab.com/ee/development/documentation/styleguide/index.html#text-for-links"
  }
]
