module gitlab.com/gitlab-org/cluster-integration/gitlab-agent/v17

go 1.23.0

require (
	buf.build/gen/go/bufbuild/protovalidate/protocolbuffers/go v1.36.5-20250219170025-d39267d9df8f.1
	cloud.google.com/go/profiler v0.4.2
	github.com/MicahParks/jwkset v0.8.0
	github.com/MicahParks/keyfunc/v3 v3.3.10
	github.com/ash2k/stager v0.4.0
	github.com/bufbuild/protovalidate-go v0.9.1
	github.com/coder/websocket v1.8.12
	github.com/docker/docker v28.0.1+incompatible
	github.com/fluxcd/notification-controller/api v1.5.0
	github.com/fluxcd/pkg/apis/meta v1.10.0
	github.com/fluxcd/source-controller/api v1.5.0
	github.com/getsentry/sentry-go v0.31.1
	github.com/go-logr/logr v1.4.2
	github.com/golang-jwt/jwt/v5 v5.2.1
	github.com/google/go-cmp v0.7.0
	github.com/grpc-ecosystem/go-grpc-middleware/providers/prometheus v1.0.1
	github.com/grpc-ecosystem/go-grpc-middleware/v2 v2.3.1
	github.com/hashicorp/go-retryablehttp v0.7.7
	github.com/munnerz/goautoneg v0.0.0-20191010083416-a7dc8b61c822
	github.com/prometheus/client_golang v1.21.1
	github.com/redis/rueidis v1.0.55
	github.com/redis/rueidis/mock v1.0.55
	github.com/redis/rueidis/rueidisotel v1.0.55
	github.com/robfig/cron/v3 v3.0.1
	github.com/spf13/cobra v1.9.1
	github.com/stretchr/testify v1.10.0
	github.com/testcontainers/testcontainers-go v0.35.0
	github.com/testcontainers/testcontainers-go/modules/k3s v0.35.0
	github.com/testcontainers/testcontainers-go/modules/redis v0.35.0
	gitlab.com/gitlab-org/security-products/analyzers/trivy-k8s-wrapper v0.8.1
	go.opentelemetry.io/contrib/instrumentation/google.golang.org/grpc/otelgrpc v0.60.0
	go.opentelemetry.io/contrib/instrumentation/net/http/otelhttp v0.60.0
	go.opentelemetry.io/otel v1.35.0
	go.opentelemetry.io/otel/exporters/otlp/otlptrace/otlptracehttp v1.35.0
	go.opentelemetry.io/otel/exporters/prometheus v0.57.0
	go.opentelemetry.io/otel/metric v1.35.0
	go.opentelemetry.io/otel/sdk v1.35.0
	go.opentelemetry.io/otel/sdk/metric v1.35.0
	go.opentelemetry.io/otel/trace v1.35.0
	go.starlark.net v0.0.0-20250225190231-0d3f41d403af
	go.temporal.io/api v1.45.0
	go.temporal.io/sdk v1.33.0
	go.temporal.io/sdk/contrib/opentelemetry v0.6.0
	// Make sure to update build/mockgen.sh when updating
	go.uber.org/mock v0.5.0
	golang.org/x/crypto v0.36.0
	golang.org/x/sync v0.12.0
	golang.org/x/time v0.11.0
	google.golang.org/api v0.223.0
	google.golang.org/genproto/googleapis/rpc v0.0.0-20250227231956-55c901821b1e
	google.golang.org/grpc v1.71.0
	google.golang.org/protobuf v1.36.5
	k8s.io/api v0.32.2
	k8s.io/apimachinery v0.32.2
	k8s.io/cli-runtime v0.32.2
	k8s.io/client-go v0.32.2
	k8s.io/klog/v2 v2.130.1
	k8s.io/kubectl v0.32.2
	k8s.io/utils v0.0.0-20241210054802-24370beab758
	sigs.k8s.io/cli-utils v0.37.3-0.20250221230426-1a9b04556153
	sigs.k8s.io/yaml v1.4.0
)

require (
	cel.dev/expr v0.19.1 // indirect
	cloud.google.com/go v0.116.0 // indirect
	cloud.google.com/go/auth v0.15.0 // indirect
	cloud.google.com/go/auth/oauth2adapt v0.2.7 // indirect
	cloud.google.com/go/compute/metadata v0.6.0 // indirect
	dario.cat/mergo v1.0.0 // indirect
	github.com/AdaLogics/go-fuzz-headers v0.0.0-20230811130428-ced1acdcaa24 // indirect
	github.com/Azure/go-ansiterm v0.0.0-20230124172434-306776ec8161 // indirect
	github.com/MakeNowJust/heredoc v1.0.0 // indirect
	github.com/Microsoft/go-winio v0.6.2 // indirect
	github.com/antlr4-go/antlr/v4 v4.13.0 // indirect
	github.com/beorn7/perks v1.0.1 // indirect
	github.com/blang/semver/v4 v4.0.0 // indirect
	github.com/cenkalti/backoff/v4 v4.3.0 // indirect
	github.com/cespare/xxhash/v2 v2.3.0 // indirect
	github.com/chai2010/gettext-go v1.0.2 // indirect
	github.com/containerd/log v0.1.0 // indirect
	github.com/containerd/platforms v0.2.1 // indirect
	github.com/cpuguy83/dockercfg v0.3.2 // indirect
	github.com/davecgh/go-spew v1.1.2-0.20180830191138-d8f796af33cc // indirect
	github.com/distribution/reference v0.6.0 // indirect
	github.com/docker/go-connections v0.5.0 // indirect
	github.com/docker/go-units v0.5.0 // indirect
	github.com/emicklei/go-restful/v3 v3.11.0 // indirect
	github.com/evanphx/json-patch/v5 v5.9.0 // indirect
	github.com/exponent-io/jsonpath v0.0.0-20210407135951-1de76d718b3f // indirect
	github.com/facebookgo/clock v0.0.0-20150410010913-600d898af40a // indirect
	github.com/fatih/camelcase v1.0.0 // indirect
	github.com/felixge/httpsnoop v1.0.4 // indirect
	github.com/fluxcd/pkg/apis/acl v0.6.0 // indirect
	github.com/fxamacker/cbor/v2 v2.7.0 // indirect
	github.com/go-errors/errors v1.4.2 // indirect
	github.com/go-logr/stdr v1.2.2 // indirect
	github.com/go-ole/go-ole v1.2.6 // indirect
	github.com/go-openapi/jsonpointer v0.21.0 // indirect
	github.com/go-openapi/jsonreference v0.20.2 // indirect
	github.com/go-openapi/swag v0.23.0 // indirect
	github.com/gogo/protobuf v1.3.2 // indirect
	github.com/golang/mock v1.6.0 // indirect
	github.com/golang/protobuf v1.5.4 // indirect
	github.com/google/btree v1.1.3 // indirect
	github.com/google/cel-go v0.23.2 // indirect
	github.com/google/gnostic-models v0.6.8 // indirect
	github.com/google/gofuzz v1.2.0 // indirect
	github.com/google/pprof v0.0.0-20241029153458-d1b30febd7db // indirect
	github.com/google/s2a-go v0.1.9 // indirect
	github.com/google/shlex v0.0.0-20191202100458-e7afc7fbc510 // indirect
	github.com/google/uuid v1.6.0 // indirect
	github.com/googleapis/enterprise-certificate-proxy v0.3.4 // indirect
	github.com/googleapis/gax-go/v2 v2.14.1 // indirect
	github.com/gorilla/websocket v1.5.0 // indirect
	github.com/gregjones/httpcache v0.0.0-20190611155906-901d90724c79 // indirect
	github.com/grpc-ecosystem/go-grpc-middleware v1.4.0 // indirect
	github.com/grpc-ecosystem/grpc-gateway/v2 v2.26.1 // indirect
	github.com/hashicorp/go-cleanhttp v0.5.2 // indirect
	github.com/inconshreveable/mousetrap v1.1.0 // indirect
	github.com/jonboulle/clockwork v0.4.0 // indirect
	github.com/josharian/intern v1.0.0 // indirect
	github.com/json-iterator/go v1.1.12 // indirect
	github.com/klauspost/compress v1.17.11 // indirect
	github.com/liggitt/tabwriter v0.0.0-20181228230101-89fcab3d43de // indirect
	github.com/lufia/plan9stats v0.0.0-20211012122336-39d0f177ccd0 // indirect
	github.com/magiconair/properties v1.8.7 // indirect
	github.com/mailru/easyjson v0.7.7 // indirect
	github.com/mitchellh/go-wordwrap v1.0.1 // indirect
	github.com/moby/docker-image-spec v1.3.1 // indirect
	github.com/moby/patternmatcher v0.6.0 // indirect
	github.com/moby/spdystream v0.5.0 // indirect
	github.com/moby/sys/sequential v0.5.0 // indirect
	github.com/moby/sys/user v0.1.0 // indirect
	github.com/moby/sys/userns v0.1.0 // indirect
	github.com/moby/term v0.5.0 // indirect
	github.com/modern-go/concurrent v0.0.0-20180306012644-bacd9c7ef1dd // indirect
	github.com/modern-go/reflect2 v1.0.2 // indirect
	github.com/monochromegane/go-gitignore v0.0.0-20200626010858-205db1a8cc00 // indirect
	github.com/morikuni/aec v1.0.0 // indirect
	github.com/mxk/go-flowrate v0.0.0-20140419014527-cca7078d478f // indirect
	github.com/nexus-rpc/sdk-go v0.3.0 // indirect
	github.com/opencontainers/go-digest v1.0.0 // indirect
	github.com/opencontainers/image-spec v1.1.0 // indirect
	github.com/pborman/uuid v1.2.1 // indirect
	github.com/peterbourgon/diskv v2.0.1+incompatible // indirect
	github.com/pkg/errors v0.9.1 // indirect
	github.com/pmezard/go-difflib v1.0.1-0.20181226105442-5d4384ee4fb2 // indirect
	github.com/power-devops/perfstat v0.0.0-20210106213030-5aafc221ea8c // indirect
	github.com/prometheus/client_model v0.6.1 // indirect
	github.com/prometheus/common v0.62.0 // indirect
	github.com/prometheus/procfs v0.15.1 // indirect
	github.com/robfig/cron v1.2.0 // indirect
	github.com/russross/blackfriday/v2 v2.1.0 // indirect
	github.com/shirou/gopsutil/v3 v3.23.12 // indirect
	github.com/shoenig/go-m1cpu v0.1.6 // indirect
	github.com/sirupsen/logrus v1.9.3 // indirect
	github.com/spf13/pflag v1.0.6 // indirect
	github.com/spyzhov/ajson v0.9.6 // indirect
	github.com/stoewer/go-strcase v1.3.0 // indirect
	github.com/stretchr/objx v0.5.2 // indirect
	github.com/tklauser/go-sysconf v0.3.12 // indirect
	github.com/tklauser/numcpus v0.6.1 // indirect
	github.com/x448/float16 v0.8.4 // indirect
	github.com/xlab/treeprint v1.2.0 // indirect
	github.com/yusufpapurcu/wmi v1.2.3 // indirect
	go.opentelemetry.io/auto/sdk v1.1.0 // indirect
	go.opentelemetry.io/otel/exporters/otlp/otlptrace v1.35.0 // indirect
	go.opentelemetry.io/proto/otlp v1.5.0 // indirect
	golang.org/x/exp v0.0.0-20240719175910-8a7402abbf56 // indirect
	golang.org/x/net v0.35.0 // indirect
	golang.org/x/oauth2 v0.26.0 // indirect
	golang.org/x/sys v0.31.0 // indirect
	golang.org/x/term v0.30.0 // indirect
	golang.org/x/text v0.23.0 // indirect
	google.golang.org/genproto v0.0.0-20241118233622-e639e219e697 // indirect
	google.golang.org/genproto/googleapis/api v0.0.0-20250218202821-56aae31c358a // indirect
	gopkg.in/evanphx/json-patch.v4 v4.12.0 // indirect
	gopkg.in/inf.v0 v0.9.1 // indirect
	gopkg.in/yaml.v3 v3.0.1 // indirect
	k8s.io/component-base v0.32.2 // indirect
	k8s.io/kube-openapi v0.0.0-20241105132330-32ad38e42d3f // indirect
	sigs.k8s.io/controller-runtime v0.20.1 // indirect
	sigs.k8s.io/json v0.0.0-20241010143419-9aa6b5e7a4b3 // indirect
	sigs.k8s.io/kustomize/api v0.18.0 // indirect
	sigs.k8s.io/kustomize/kyaml v0.18.1 // indirect
	sigs.k8s.io/structured-merge-diff/v4 v4.4.2 // indirect
)
