{
  "name": "@$NPM_PACKAGE_SCOPE/smoke-test",
  "version": "1.0.0-job$CI_JOB_ID",
  "description": "A smoke test for the GitLab NPM Registry",
  "main": "index.js",
  "publishConfig": {
    "@$NPM_PACKAGE_SCOPE:registry": "$CI_SERVER_URL/api/v4/projects/$CI_PROJECT_ID/packages/npm/"
  }
}
