{
    "dashboards": [
        {
            "__Dashboard__": {
                "css": "",
                "dashboard_title": "Gitaly Dashboard",
                "description": null,
                "json_metadata": "{\"timed_refresh_immune_slices\": [], \"expanded_slices\": {}, \"refresh_frequency\": 0, \"default_filters\": \"{}\", \"color_scheme\": null, \"remote_id\": 2, \"import_time\": 1631004713}",
                "position_json": "{\"CHART-24Lc5fQhOf\":{\"children\":[],\"id\":\"CHART-24Lc5fQhOf\",\"meta\":{\"chartId\":16,\"height\":50,\"sliceName\":\"gitaly client rate (per minute)\",\"uuid\":\"ff9f593b-b067-4000-9cae-830e0c470994\",\"width\":12},\"parents\":[\"ROOT_ID\",\"GRID_ID\",\"TABS-h8qH7KXcfx\",\"TAB-TyD9vxLrqG\",\"ROW-R4qLTz-WR4\"],\"type\":\"CHART\"},\"CHART-58et6-e4t2\":{\"children\":[],\"id\":\"CHART-58et6-e4t2\",\"meta\":{\"chartId\":14,\"height\":46,\"sliceName\":\"gitaly list of requests\",\"uuid\":\"ecfa73e6-569c-4398-9ecc-bd459e42fa40\",\"width\":12},\"parents\":[\"ROOT_ID\",\"GRID_ID\",\"TABS-h8qH7KXcfx\",\"TAB-lyQL-TCoP\",\"ROW-184AWkKkav\"],\"type\":\"CHART\"},\"CHART-IKRu0kjIsD\":{\"children\":[],\"id\":\"CHART-IKRu0kjIsD\",\"meta\":{\"chartId\":10,\"height\":49,\"sliceName\":\"gitaly method rate (per 15 minutes)\",\"uuid\":\"ba813c5f-4f1c-4136-b063-04ef6444caf6\",\"width\":12},\"parents\":[\"ROOT_ID\",\"GRID_ID\",\"TABS-h8qH7KXcfx\",\"TAB-XWyOcHD_o\",\"ROW-jnVqbIzJuk\"],\"type\":\"CHART\"},\"CHART-LX-Rvtg1Dj\":{\"children\":[],\"id\":\"CHART-LX-Rvtg1Dj\",\"meta\":{\"chartId\":33,\"height\":50,\"sliceName\":\"gitaly total request rate (per 15 minute)\",\"uuid\":\"ed7fd421-1d8e-4896-ba6f-155a0a25638e\",\"width\":12},\"parents\":[\"ROOT_ID\",\"GRID_ID\",\"TABS-h8qH7KXcfx\",\"TAB-XWyOcHD_o\",\"ROW-6RsC0xPfVq\"],\"type\":\"CHART\"},\"CHART-Vbo9TLMA40\":{\"children\":[],\"id\":\"CHART-Vbo9TLMA40\",\"meta\":{\"chartId\":15,\"height\":51,\"sliceName\":\"gitaly list of requests (> 500 milliseconds)\",\"uuid\":\"ae2bd0a5-b111-423b-9bfb-96290aeaa8b5\",\"width\":12},\"parents\":[\"ROOT_ID\",\"GRID_ID\",\"TABS-h8qH7KXcfx\",\"TAB-lyQL-TCoP\",\"ROW-Karv4tv760\"],\"type\":\"CHART\"},\"CHART-Whbz2M9K2N\":{\"children\":[],\"id\":\"CHART-Whbz2M9K2N\",\"meta\":{\"chartId\":12,\"height\":50,\"sliceName\":\"gitaly project rate (per minute)\",\"uuid\":\"e1e05434-6a6d-4734-9ed6-b9b6e407e0fc\",\"width\":12},\"parents\":[\"ROOT_ID\",\"GRID_ID\",\"TABS-h8qH7KXcfx\",\"TAB-TyD9vxLrqG\",\"ROW-i_0AKqBMbs\"],\"type\":\"CHART\"},\"CHART-em_j9zxvT7\":{\"children\":[],\"id\":\"CHART-em_j9zxvT7\",\"meta\":{\"chartId\":9,\"height\":51,\"sliceName\":\"gitaly method rate (per minute)\",\"uuid\":\"a925b46f-28fb-48f1-81e7-8512bcc6e001\",\"width\":12},\"parents\":[\"ROOT_ID\",\"GRID_ID\",\"TABS-h8qH7KXcfx\",\"TAB-TyD9vxLrqG\",\"ROW-wxzU0T5Gp\"],\"type\":\"CHART\"},\"CHART-lh6fwto0Jl\":{\"children\":[],\"id\":\"CHART-lh6fwto0Jl\",\"meta\":{\"chartId\":17,\"height\":49,\"sliceName\":\"gitaly client rate (per 15 minute)\",\"uuid\":\"cf4d339c-af30-48dd-a40c-c06e84f29772\",\"width\":12},\"parents\":[\"ROOT_ID\",\"GRID_ID\",\"TABS-h8qH7KXcfx\",\"TAB-XWyOcHD_o\",\"ROW-7zACqFU4Vm\"],\"type\":\"CHART\"},\"CHART-msM5vr4sK4\":{\"children\":[],\"id\":\"CHART-msM5vr4sK4\",\"meta\":{\"chartId\":13,\"height\":49,\"sliceName\":\"gitaly project rate (per 15 minute)\",\"uuid\":\"be9de87e-3698-48c7-a30c-15cb4c23cb1e\",\"width\":12},\"parents\":[\"ROOT_ID\",\"GRID_ID\",\"TABS-h8qH7KXcfx\",\"TAB-XWyOcHD_o\",\"ROW-fu-QQZO4zi\"],\"type\":\"CHART\"},\"CHART-qnVjCfGH4i\":{\"children\":[],\"id\":\"CHART-qnVjCfGH4i\",\"meta\":{\"chartId\":11,\"height\":50,\"sliceName\":\"gitaly total request rate (per minute)\",\"uuid\":\"0d5211fb-3b16-44c7-bd7f-13a408abea87\",\"width\":12},\"parents\":[\"ROOT_ID\",\"GRID_ID\",\"TABS-h8qH7KXcfx\",\"TAB-TyD9vxLrqG\",\"ROW-vLQyr-kLOg\"],\"type\":\"CHART\"},\"DASHBOARD_VERSION_KEY\":\"v2\",\"GRID_ID\":{\"children\":[\"TABS-h8qH7KXcfx\"],\"id\":\"GRID_ID\",\"parents\":[\"ROOT_ID\"],\"type\":\"GRID\"},\"HEADER_ID\":{\"id\":\"HEADER_ID\",\"meta\":{\"text\":\"Gitaly Dashboard\"},\"type\":\"HEADER\"},\"ROOT_ID\":{\"children\":[\"GRID_ID\"],\"id\":\"ROOT_ID\",\"type\":\"ROOT\"},\"ROW-184AWkKkav\":{\"children\":[\"CHART-58et6-e4t2\"],\"id\":\"ROW-184AWkKkav\",\"meta\":{\"background\":\"BACKGROUND_TRANSPARENT\"},\"parents\":[\"ROOT_ID\",\"GRID_ID\",\"TABS-h8qH7KXcfx\",\"TAB-lyQL-TCoP\"],\"type\":\"ROW\"},\"ROW-6RsC0xPfVq\":{\"children\":[\"CHART-LX-Rvtg1Dj\"],\"id\":\"ROW-6RsC0xPfVq\",\"meta\":{\"background\":\"BACKGROUND_TRANSPARENT\"},\"parents\":[\"ROOT_ID\",\"GRID_ID\",\"TABS-h8qH7KXcfx\",\"TAB-XWyOcHD_o\"],\"type\":\"ROW\"},\"ROW-7zACqFU4Vm\":{\"children\":[\"CHART-lh6fwto0Jl\"],\"id\":\"ROW-7zACqFU4Vm\",\"meta\":{\"background\":\"BACKGROUND_TRANSPARENT\"},\"parents\":[\"ROOT_ID\",\"GRID_ID\",\"TABS-h8qH7KXcfx\",\"TAB-XWyOcHD_o\"],\"type\":\"ROW\"},\"ROW-Karv4tv760\":{\"children\":[\"CHART-Vbo9TLMA40\"],\"id\":\"ROW-Karv4tv760\",\"meta\":{\"background\":\"BACKGROUND_TRANSPARENT\"},\"parents\":[\"ROOT_ID\",\"GRID_ID\",\"TABS-h8qH7KXcfx\",\"TAB-lyQL-TCoP\"],\"type\":\"ROW\"},\"ROW-R4qLTz-WR4\":{\"children\":[\"CHART-24Lc5fQhOf\"],\"id\":\"ROW-R4qLTz-WR4\",\"meta\":{\"background\":\"BACKGROUND_TRANSPARENT\"},\"parents\":[\"ROOT_ID\",\"GRID_ID\",\"TABS-h8qH7KXcfx\",\"TAB-TyD9vxLrqG\"],\"type\":\"ROW\"},\"ROW-fu-QQZO4zi\":{\"children\":[\"CHART-msM5vr4sK4\"],\"id\":\"ROW-fu-QQZO4zi\",\"meta\":{\"background\":\"BACKGROUND_TRANSPARENT\"},\"parents\":[\"ROOT_ID\",\"GRID_ID\",\"TABS-h8qH7KXcfx\",\"TAB-XWyOcHD_o\"],\"type\":\"ROW\"},\"ROW-i_0AKqBMbs\":{\"children\":[\"CHART-Whbz2M9K2N\"],\"id\":\"ROW-i_0AKqBMbs\",\"meta\":{\"background\":\"BACKGROUND_TRANSPARENT\"},\"parents\":[\"ROOT_ID\",\"GRID_ID\",\"TABS-h8qH7KXcfx\",\"TAB-TyD9vxLrqG\"],\"type\":\"ROW\"},\"ROW-jnVqbIzJuk\":{\"children\":[\"CHART-IKRu0kjIsD\"],\"id\":\"ROW-jnVqbIzJuk\",\"meta\":{\"background\":\"BACKGROUND_TRANSPARENT\"},\"parents\":[\"ROOT_ID\",\"GRID_ID\",\"TABS-h8qH7KXcfx\",\"TAB-XWyOcHD_o\"],\"type\":\"ROW\"},\"ROW-vLQyr-kLOg\":{\"children\":[\"CHART-qnVjCfGH4i\"],\"id\":\"ROW-vLQyr-kLOg\",\"meta\":{\"background\":\"BACKGROUND_TRANSPARENT\"},\"parents\":[\"ROOT_ID\",\"GRID_ID\",\"TABS-h8qH7KXcfx\",\"TAB-TyD9vxLrqG\"],\"type\":\"ROW\"},\"ROW-wxzU0T5Gp\":{\"children\":[\"CHART-em_j9zxvT7\"],\"id\":\"ROW-wxzU0T5Gp\",\"meta\":{\"background\":\"BACKGROUND_TRANSPARENT\"},\"parents\":[\"ROOT_ID\",\"GRID_ID\",\"TABS-h8qH7KXcfx\",\"TAB-TyD9vxLrqG\"],\"type\":\"ROW\"},\"TAB-TyD9vxLrqG\":{\"children\":[\"ROW-wxzU0T5Gp\",\"ROW-i_0AKqBMbs\",\"ROW-R4qLTz-WR4\",\"ROW-vLQyr-kLOg\"],\"id\":\"TAB-TyD9vxLrqG\",\"meta\":{\"defaultText\":\"Tab title\",\"placeholder\":\"Tab title\",\"text\":\"per minute\"},\"parents\":[\"ROOT_ID\",\"GRID_ID\",\"TABS-h8qH7KXcfx\"],\"type\":\"TAB\"},\"TAB-XWyOcHD_o\":{\"children\":[\"ROW-jnVqbIzJuk\",\"ROW-fu-QQZO4zi\",\"ROW-7zACqFU4Vm\",\"ROW-6RsC0xPfVq\"],\"id\":\"TAB-XWyOcHD_o\",\"meta\":{\"defaultText\":\"Tab title\",\"placeholder\":\"Tab title\",\"text\":\"per 15 minutes\"},\"parents\":[\"ROOT_ID\",\"GRID_ID\",\"TABS-h8qH7KXcfx\"],\"type\":\"TAB\"},\"TAB-lyQL-TCoP\":{\"children\":[\"ROW-184AWkKkav\",\"ROW-Karv4tv760\"],\"id\":\"TAB-lyQL-TCoP\",\"meta\":{\"defaultText\":\"Tab title\",\"placeholder\":\"Tab title\",\"text\":\"list of requests\"},\"parents\":[\"ROOT_ID\",\"GRID_ID\",\"TABS-h8qH7KXcfx\"],\"type\":\"TAB\"},\"TABS-h8qH7KXcfx\":{\"children\":[\"TAB-TyD9vxLrqG\",\"TAB-XWyOcHD_o\",\"TAB-lyQL-TCoP\"],\"id\":\"TABS-h8qH7KXcfx\",\"meta\":{},\"parents\":[\"ROOT_ID\",\"GRID_ID\"],\"type\":\"TABS\"}}",
                "slices": [
                    {
                        "__Slice__": {
                            "cache_timeout": null,
                            "datasource_name": "druid.gitaly",
                            "datasource_type": "table",
                            "id": 9,
                            "params": "{\"adhoc_filters\": [], \"annotation_layers\": [], \"bottom_margin\": \"auto\", \"color_scheme\": \"supersetColors\", \"comparison_type\": \"values\", \"datasource\": \"4__table\", \"extra_form_data\": {}, \"granularity_sqla\": \"__time\", \"groupby\": [\"grpc.method\"], \"label_colors\": {}, \"left_margin\": \"auto\", \"limit\": 500, \"line_interpolation\": \"linear\", \"metrics\": [\"count\"], \"order_desc\": true, \"rich_tooltip\": false, \"rolling_type\": \"None\", \"row_limit\": 10000, \"show_brush\": \"auto\", \"show_legend\": false, \"show_markers\": true, \"slice_id\": 21, \"time_grain_sqla\": \"PT1M\", \"time_range\": \"No filter\", \"time_range_endpoints\": [\"inclusive\", \"exclusive\"], \"url_params\": {}, \"viz_type\": \"line\", \"x_axis_format\": \"smart_date\", \"x_axis_label\": \"time\", \"x_axis_showminmax\": true, \"x_ticks_layout\": \"auto\", \"y_axis_bounds\": [null, null], \"y_axis_format\": \"SMART_NUMBER\", \"y_axis_label\": \"number of requests\", \"y_axis_showminmax\": true, \"remote_id\": 9, \"datasource_name\": \"gitaly\", \"schema\": \"druid\", \"database_name\": \"Druid\", \"import_time\": 1631004713}",
                            "slice_name": "gitaly method rate (per minute)",
                            "viz_type": "line"
                        }
                    },
                    {
                        "__Slice__": {
                            "cache_timeout": null,
                            "datasource_name": "druid.gitaly",
                            "datasource_type": "table",
                            "id": 10,
                            "params": "{\"adhoc_filters\": [], \"annotation_layers\": [], \"bottom_margin\": \"auto\", \"color_scheme\": \"supersetColors\", \"comparison_type\": \"values\", \"datasource\": \"4__table\", \"extra_form_data\": {}, \"granularity_sqla\": \"__time\", \"groupby\": [\"grpc.method\"], \"label_colors\": {}, \"left_margin\": \"auto\", \"limit\": 500, \"line_interpolation\": \"linear\", \"metrics\": [\"count\"], \"order_desc\": true, \"rich_tooltip\": false, \"rolling_type\": \"None\", \"row_limit\": 10000, \"show_brush\": \"auto\", \"show_legend\": false, \"show_markers\": true, \"slice_id\": 22, \"time_grain_sqla\": \"PT15M\", \"time_range\": \"No filter\", \"time_range_endpoints\": [\"inclusive\", \"exclusive\"], \"url_params\": {}, \"viz_type\": \"line\", \"x_axis_format\": \"smart_date\", \"x_axis_label\": \"time\", \"x_axis_showminmax\": true, \"x_ticks_layout\": \"auto\", \"y_axis_bounds\": [null, null], \"y_axis_format\": \"SMART_NUMBER\", \"y_axis_label\": \"number of requests\", \"y_axis_showminmax\": true, \"remote_id\": 10, \"datasource_name\": \"gitaly\", \"schema\": \"druid\", \"database_name\": \"Druid\", \"import_time\": 1631004713}",
                            "slice_name": "gitaly method rate (per 15 minutes)",
                            "viz_type": "line"
                        }
                    },
                    {
                        "__Slice__": {
                            "cache_timeout": null,
                            "datasource_name": "druid.gitaly",
                            "datasource_type": "table",
                            "id": 11,
                            "params": "{\"adhoc_filters\": [], \"annotation_layers\": [], \"bottom_margin\": \"auto\", \"color_scheme\": \"supersetColors\", \"comparison_type\": \"values\", \"datasource\": \"4__table\", \"extra_form_data\": {}, \"granularity_sqla\": \"__time\", \"groupby\": [], \"label_colors\": {}, \"left_margin\": \"auto\", \"limit\": 500, \"line_interpolation\": \"linear\", \"metrics\": [\"count\"], \"order_desc\": true, \"rich_tooltip\": false, \"rolling_type\": \"None\", \"row_limit\": 10000, \"show_brush\": \"auto\", \"show_legend\": false, \"show_markers\": true, \"time_grain_sqla\": \"PT1M\", \"time_range\": \"No filter\", \"time_range_endpoints\": [\"inclusive\", \"exclusive\"], \"url_params\": {}, \"viz_type\": \"line\", \"x_axis_format\": \"smart_date\", \"x_axis_label\": \"time\", \"x_axis_showminmax\": true, \"x_ticks_layout\": \"auto\", \"y_axis_bounds\": [null, null], \"y_axis_format\": \"SMART_NUMBER\", \"y_axis_label\": \"number of requests\", \"y_axis_showminmax\": true, \"remote_id\": 11, \"datasource_name\": \"gitaly\", \"schema\": \"druid\", \"database_name\": \"Druid\", \"import_time\": 1631004713}",
                            "slice_name": "gitaly total request rate (per minute)",
                            "viz_type": "line"
                        }
                    },
                    {
                        "__Slice__": {
                            "cache_timeout": null,
                            "datasource_name": "druid.gitaly",
                            "datasource_type": "table",
                            "id": 12,
                            "params": "{\"adhoc_filters\": [], \"annotation_layers\": [], \"bottom_margin\": \"auto\", \"color_scheme\": \"supersetColors\", \"comparison_type\": \"values\", \"datasource\": \"4__table\", \"extra_form_data\": {}, \"granularity_sqla\": \"__time\", \"groupby\": [\"grpc.request.glProjectPath\"], \"label_colors\": {}, \"left_margin\": \"auto\", \"limit\": 500, \"line_interpolation\": \"linear\", \"metrics\": [\"count\"], \"order_desc\": true, \"rich_tooltip\": false, \"rolling_type\": \"None\", \"row_limit\": 10000, \"show_brush\": \"auto\", \"show_legend\": false, \"show_markers\": true, \"time_grain_sqla\": \"PT1M\", \"time_range\": \"No filter\", \"time_range_endpoints\": [\"inclusive\", \"exclusive\"], \"url_params\": {}, \"viz_type\": \"line\", \"x_axis_format\": \"smart_date\", \"x_axis_label\": \"time\", \"x_axis_showminmax\": true, \"x_ticks_layout\": \"auto\", \"y_axis_bounds\": [null, null], \"y_axis_format\": \"SMART_NUMBER\", \"y_axis_label\": \"number of requests\", \"y_axis_showminmax\": true, \"remote_id\": 12, \"datasource_name\": \"gitaly\", \"schema\": \"druid\", \"database_name\": \"Druid\", \"import_time\": 1631004713}",
                            "slice_name": "gitaly project rate (per minute)",
                            "viz_type": "line"
                        }
                    },
                    {
                        "__Slice__": {
                            "cache_timeout": null,
                            "datasource_name": "druid.gitaly",
                            "datasource_type": "table",
                            "id": 13,
                            "params": "{\"adhoc_filters\": [], \"annotation_layers\": [], \"bottom_margin\": \"auto\", \"color_scheme\": \"supersetColors\", \"comparison_type\": \"values\", \"datasource\": \"4__table\", \"extra_form_data\": {}, \"granularity_sqla\": \"__time\", \"groupby\": [\"grpc.request.glProjectPath\"], \"label_colors\": {}, \"left_margin\": \"auto\", \"limit\": 500, \"line_interpolation\": \"linear\", \"metrics\": [\"count\"], \"order_desc\": true, \"rich_tooltip\": false, \"rolling_type\": \"None\", \"row_limit\": 10000, \"show_brush\": \"auto\", \"show_legend\": false, \"show_markers\": true, \"time_grain_sqla\": \"PT15M\", \"time_range\": \"No filter\", \"time_range_endpoints\": [\"inclusive\", \"exclusive\"], \"url_params\": {}, \"viz_type\": \"line\", \"x_axis_format\": \"smart_date\", \"x_axis_label\": \"time\", \"x_axis_showminmax\": true, \"x_ticks_layout\": \"auto\", \"y_axis_bounds\": [null, null], \"y_axis_format\": \"SMART_NUMBER\", \"y_axis_label\": \"number of requests\", \"y_axis_showminmax\": true, \"remote_id\": 13, \"datasource_name\": \"gitaly\", \"schema\": \"druid\", \"database_name\": \"Druid\", \"import_time\": 1631004713}",
                            "slice_name": "gitaly project rate (per 15 minute)",
                            "viz_type": "line"
                        }
                    },
                    {
                        "__Slice__": {
                            "cache_timeout": null,
                            "datasource_name": "druid.gitaly",
                            "datasource_type": "table",
                            "id": 14,
                            "params": "{\"adhoc_filters\": [], \"all_columns\": [], \"color_pn\": true, \"datasource\": \"4__table\", \"extra_form_data\": {}, \"granularity_sqla\": \"__time\", \"groupby\": [\"grpc.method\", \"grpc.request.glProjectPath\", \"username\"], \"metrics\": [\"count\"], \"order_by_cols\": [], \"order_desc\": true, \"percent_metrics\": [], \"query_mode\": \"aggregate\", \"row_limit\": 10000, \"server_page_length\": 10, \"show_cell_bars\": true, \"table_timestamp_format\": \"smart_date\", \"time_grain_sqla\": null, \"time_range\": \"No filter\", \"time_range_endpoints\": [\"inclusive\", \"exclusive\"], \"url_params\": {}, \"viz_type\": \"table\", \"remote_id\": 14, \"datasource_name\": \"gitaly\", \"schema\": \"druid\", \"database_name\": \"Druid\", \"import_time\": 1631004713}",
                            "slice_name": "gitaly list of requests",
                            "viz_type": "table"
                        }
                    },
                    {
                        "__Slice__": {
                            "cache_timeout": null,
                            "datasource_name": "druid.gitaly",
                            "datasource_type": "table",
                            "id": 15,
                            "params": "{\"adhoc_filters\": [{\"clause\": \"WHERE\", \"comparator\": \"500\", \"expressionType\": \"SIMPLE\", \"filterOptionName\": \"filter_0gakuwi8sc1_z23df3hayue\", \"isExtra\": false, \"isNew\": false, \"operator\": \">\", \"sqlExpression\": null, \"subject\": \"grpc.time_ms\"}], \"all_columns\": [\"__time\", \"correlation_id\", \"grpc.method\", \"grpc.request.fullMethod\", \"grpc.request.glProjectPath\", \"username\", \"command.real_time_ms\", \"command.system_time_ms\", \"command.user_time_ms\", \"grpc.time_ms\"], \"color_pn\": true, \"datasource\": \"4__table\", \"extra_form_data\": {}, \"granularity_sqla\": \"__time\", \"groupby\": [\"grpc.method\", \"grpc.request.glProjectPath\", \"username\"], \"metrics\": [\"count\"], \"order_by_cols\": [], \"order_desc\": true, \"percent_metrics\": [], \"query_mode\": \"raw\", \"row_limit\": 10000, \"server_page_length\": 10, \"show_cell_bars\": true, \"table_timestamp_format\": \"smart_date\", \"time_grain_sqla\": null, \"time_range\": \"No filter\", \"time_range_endpoints\": [\"inclusive\", \"exclusive\"], \"url_params\": {}, \"viz_type\": \"table\", \"remote_id\": 15, \"datasource_name\": \"gitaly\", \"schema\": \"druid\", \"database_name\": \"Druid\", \"import_time\": 1631004713}",
                            "slice_name": "gitaly list of requests (> 500 milliseconds)",
                            "viz_type": "table"
                        }
                    },
                    {
                        "__Slice__": {
                            "cache_timeout": null,
                            "datasource_name": "druid.gitaly",
                            "datasource_type": "table",
                            "id": 16,
                            "params": "{\"adhoc_filters\": [], \"annotation_layers\": [], \"bottom_margin\": \"auto\", \"color_scheme\": \"supersetColors\", \"comparison_type\": \"values\", \"datasource\": \"4__table\", \"extra_form_data\": {}, \"granularity_sqla\": \"__time\", \"groupby\": [\"grpc.meta.client_name\"], \"label_colors\": {}, \"left_margin\": \"auto\", \"limit\": 500, \"line_interpolation\": \"linear\", \"metrics\": [\"count\"], \"order_desc\": true, \"rich_tooltip\": false, \"rolling_type\": \"None\", \"row_limit\": 10000, \"show_brush\": \"auto\", \"show_legend\": false, \"show_markers\": true, \"time_grain_sqla\": \"PT1M\", \"time_range\": \"No filter\", \"time_range_endpoints\": [\"inclusive\", \"exclusive\"], \"url_params\": {}, \"viz_type\": \"line\", \"x_axis_format\": \"smart_date\", \"x_axis_label\": \"time\", \"x_axis_showminmax\": true, \"x_ticks_layout\": \"auto\", \"y_axis_bounds\": [null, null], \"y_axis_format\": \"SMART_NUMBER\", \"y_axis_label\": \"number of requests\", \"y_axis_showminmax\": true, \"remote_id\": 16, \"datasource_name\": \"gitaly\", \"schema\": \"druid\", \"database_name\": \"Druid\", \"import_time\": 1631004713}",
                            "slice_name": "gitaly client rate (per minute)",
                            "viz_type": "line"
                        }
                    },
                    {
                        "__Slice__": {
                            "cache_timeout": null,
                            "datasource_name": "druid.gitaly",
                            "datasource_type": "table",
                            "id": 17,
                            "params": "{\"adhoc_filters\": [], \"annotation_layers\": [], \"bottom_margin\": \"auto\", \"color_scheme\": \"supersetColors\", \"comparison_type\": \"values\", \"datasource\": \"4__table\", \"extra_form_data\": {}, \"granularity_sqla\": \"__time\", \"groupby\": [\"grpc.meta.client_name\"], \"label_colors\": {}, \"left_margin\": \"auto\", \"limit\": 500, \"line_interpolation\": \"linear\", \"metrics\": [\"count\"], \"order_desc\": true, \"rich_tooltip\": false, \"rolling_type\": \"None\", \"row_limit\": 10000, \"show_brush\": \"auto\", \"show_legend\": false, \"show_markers\": true, \"time_grain_sqla\": \"PT15M\", \"time_range\": \"No filter\", \"time_range_endpoints\": [\"inclusive\", \"exclusive\"], \"url_params\": {}, \"viz_type\": \"line\", \"x_axis_format\": \"smart_date\", \"x_axis_label\": \"time\", \"x_axis_showminmax\": true, \"x_ticks_layout\": \"auto\", \"y_axis_bounds\": [null, null], \"y_axis_format\": \"SMART_NUMBER\", \"y_axis_label\": \"number of requests\", \"y_axis_showminmax\": true, \"remote_id\": 17, \"datasource_name\": \"gitaly\", \"schema\": \"druid\", \"database_name\": \"Druid\", \"import_time\": 1631004713}",
                            "slice_name": "gitaly client rate (per 15 minute)",
                            "viz_type": "line"
                        }
                    },
                    {
                        "__Slice__": {
                            "cache_timeout": null,
                            "datasource_name": "druid.gitaly",
                            "datasource_type": "table",
                            "id": 33,
                            "params": "{\"adhoc_filters\": [], \"annotation_layers\": [], \"bottom_margin\": \"auto\", \"color_scheme\": \"supersetColors\", \"comparison_type\": \"values\", \"datasource\": \"2__table\", \"extra_form_data\": {}, \"granularity_sqla\": \"__time\", \"groupby\": [], \"label_colors\": {}, \"left_margin\": \"auto\", \"limit\": 500, \"line_interpolation\": \"linear\", \"metrics\": [\"count\"], \"order_desc\": true, \"rich_tooltip\": false, \"rolling_type\": \"None\", \"row_limit\": 10000, \"show_brush\": \"auto\", \"show_legend\": false, \"show_markers\": true, \"time_grain_sqla\": \"PT15M\", \"time_range\": \"No filter\", \"time_range_endpoints\": [\"inclusive\", \"exclusive\"], \"url_params\": {}, \"viz_type\": \"line\", \"x_axis_format\": \"smart_date\", \"x_axis_label\": \"time\", \"x_axis_showminmax\": true, \"x_ticks_layout\": \"auto\", \"y_axis_bounds\": [null, null], \"y_axis_format\": \"SMART_NUMBER\", \"y_axis_label\": \"number of requests\", \"y_axis_showminmax\": true, \"remote_id\": 33, \"datasource_name\": \"gitaly\", \"schema\": \"druid\", \"database_name\": \"Druid\"}",
                            "slice_name": "gitaly total request rate (per 15 minute)",
                            "viz_type": "line"
                        }
                    }
                ],
                "slug": null
            }
        }
    ],
    "datasources": [
        {
            "__SqlaTable__": {
                "cache_timeout": null,
                "columns": [
                    {
                        "__TableColumn__": {
                            "changed_by_fk": 1,
                            "changed_on": {
                                "__datetime__": "2021-09-07T08:51:52"
                            },
                            "column_name": "__time",
                            "created_by_fk": 1,
                            "created_on": {
                                "__datetime__": "2021-09-07T08:51:52"
                            },
                            "description": null,
                            "expression": null,
                            "filterable": true,
                            "groupby": true,
                            "id": 38,
                            "is_active": true,
                            "is_dttm": true,
                            "python_date_format": null,
                            "table_id": 2,
                            "type": "LONG",
                            "uuid": "0f754f18-0ea5-49ca-9593-a8539cb5aa78",
                            "verbose_name": null
                        }
                    },
                    {
                        "__TableColumn__": {
                            "changed_by_fk": 1,
                            "changed_on": {
                                "__datetime__": "2021-09-07T08:51:52"
                            },
                            "column_name": "command.count",
                            "created_by_fk": 1,
                            "created_on": {
                                "__datetime__": "2021-09-07T08:51:52"
                            },
                            "description": null,
                            "expression": null,
                            "filterable": true,
                            "groupby": true,
                            "id": 39,
                            "is_active": true,
                            "is_dttm": false,
                            "python_date_format": null,
                            "table_id": 2,
                            "type": "LONG",
                            "uuid": "51a84714-93b1-4983-bce9-32d27d5f2393",
                            "verbose_name": null
                        }
                    },
                    {
                        "__TableColumn__": {
                            "changed_by_fk": 1,
                            "changed_on": {
                                "__datetime__": "2021-09-07T08:51:52"
                            },
                            "column_name": "command.inblock",
                            "created_by_fk": 1,
                            "created_on": {
                                "__datetime__": "2021-09-07T08:51:52"
                            },
                            "description": null,
                            "expression": null,
                            "filterable": true,
                            "groupby": true,
                            "id": 40,
                            "is_active": true,
                            "is_dttm": false,
                            "python_date_format": null,
                            "table_id": 2,
                            "type": "LONG",
                            "uuid": "66369f8a-b589-4caf-9994-738823a96521",
                            "verbose_name": null
                        }
                    },
                    {
                        "__TableColumn__": {
                            "changed_by_fk": 1,
                            "changed_on": {
                                "__datetime__": "2021-09-07T08:51:52"
                            },
                            "column_name": "command.majflt",
                            "created_by_fk": 1,
                            "created_on": {
                                "__datetime__": "2021-09-07T08:51:52"
                            },
                            "description": null,
                            "expression": null,
                            "filterable": true,
                            "groupby": true,
                            "id": 41,
                            "is_active": true,
                            "is_dttm": false,
                            "python_date_format": null,
                            "table_id": 2,
                            "type": "LONG",
                            "uuid": "2db7e160-2419-47a2-abe6-ed0137560e67",
                            "verbose_name": null
                        }
                    },
                    {
                        "__TableColumn__": {
                            "changed_by_fk": 1,
                            "changed_on": {
                                "__datetime__": "2021-09-07T08:51:52"
                            },
                            "column_name": "command.maxrss",
                            "created_by_fk": 1,
                            "created_on": {
                                "__datetime__": "2021-09-07T08:51:52"
                            },
                            "description": null,
                            "expression": null,
                            "filterable": true,
                            "groupby": true,
                            "id": 42,
                            "is_active": true,
                            "is_dttm": false,
                            "python_date_format": null,
                            "table_id": 2,
                            "type": "LONG",
                            "uuid": "bc857411-07d5-4649-aeb8-a0e62f556fac",
                            "verbose_name": null
                        }
                    },
                    {
                        "__TableColumn__": {
                            "changed_by_fk": 1,
                            "changed_on": {
                                "__datetime__": "2021-09-07T08:51:52"
                            },
                            "column_name": "command.minflt",
                            "created_by_fk": 1,
                            "created_on": {
                                "__datetime__": "2021-09-07T08:51:52"
                            },
                            "description": null,
                            "expression": null,
                            "filterable": true,
                            "groupby": true,
                            "id": 43,
                            "is_active": true,
                            "is_dttm": false,
                            "python_date_format": null,
                            "table_id": 2,
                            "type": "LONG",
                            "uuid": "3d9c604c-0717-47eb-b29d-d897b98ac0b3",
                            "verbose_name": null
                        }
                    },
                    {
                        "__TableColumn__": {
                            "changed_by_fk": 1,
                            "changed_on": {
                                "__datetime__": "2021-09-07T08:51:52"
                            },
                            "column_name": "command.oublock",
                            "created_by_fk": 1,
                            "created_on": {
                                "__datetime__": "2021-09-07T08:51:52"
                            },
                            "description": null,
                            "expression": null,
                            "filterable": true,
                            "groupby": true,
                            "id": 44,
                            "is_active": true,
                            "is_dttm": false,
                            "python_date_format": null,
                            "table_id": 2,
                            "type": "LONG",
                            "uuid": "4de936bc-d933-4075-95fe-631caa47caa8",
                            "verbose_name": null
                        }
                    },
                    {
                        "__TableColumn__": {
                            "changed_by_fk": 1,
                            "changed_on": {
                                "__datetime__": "2021-09-07T08:51:52"
                            },
                            "column_name": "command.real_time_ms",
                            "created_by_fk": 1,
                            "created_on": {
                                "__datetime__": "2021-09-07T08:51:52"
                            },
                            "description": null,
                            "expression": null,
                            "filterable": true,
                            "groupby": true,
                            "id": 45,
                            "is_active": true,
                            "is_dttm": false,
                            "python_date_format": null,
                            "table_id": 2,
                            "type": "LONG",
                            "uuid": "10b53708-16f9-4c59-8247-67b2584e975d",
                            "verbose_name": null
                        }
                    },
                    {
                        "__TableColumn__": {
                            "changed_by_fk": 1,
                            "changed_on": {
                                "__datetime__": "2021-09-07T08:51:52"
                            },
                            "column_name": "command.system_time_ms",
                            "created_by_fk": 1,
                            "created_on": {
                                "__datetime__": "2021-09-07T08:51:52"
                            },
                            "description": null,
                            "expression": null,
                            "filterable": true,
                            "groupby": true,
                            "id": 46,
                            "is_active": true,
                            "is_dttm": false,
                            "python_date_format": null,
                            "table_id": 2,
                            "type": "LONG",
                            "uuid": "f6121ee1-71b9-45c3-9c8b-e9d7aa75cc55",
                            "verbose_name": null
                        }
                    },
                    {
                        "__TableColumn__": {
                            "changed_by_fk": 1,
                            "changed_on": {
                                "__datetime__": "2021-09-07T08:51:52"
                            },
                            "column_name": "command.user_time_ms",
                            "created_by_fk": 1,
                            "created_on": {
                                "__datetime__": "2021-09-07T08:51:52"
                            },
                            "description": null,
                            "expression": null,
                            "filterable": true,
                            "groupby": true,
                            "id": 47,
                            "is_active": true,
                            "is_dttm": false,
                            "python_date_format": null,
                            "table_id": 2,
                            "type": "LONG",
                            "uuid": "9274b108-dde7-4637-975c-7f42deede689",
                            "verbose_name": null
                        }
                    },
                    {
                        "__TableColumn__": {
                            "changed_by_fk": 1,
                            "changed_on": {
                                "__datetime__": "2021-09-07T08:51:52"
                            },
                            "column_name": "correlation_id",
                            "created_by_fk": 1,
                            "created_on": {
                                "__datetime__": "2021-09-07T08:51:52"
                            },
                            "description": null,
                            "expression": null,
                            "filterable": true,
                            "groupby": true,
                            "id": 48,
                            "is_active": true,
                            "is_dttm": false,
                            "python_date_format": null,
                            "table_id": 2,
                            "type": "STRING",
                            "uuid": "1eb52cdb-83dd-498d-b9a9-9a9c58948089",
                            "verbose_name": null
                        }
                    },
                    {
                        "__TableColumn__": {
                            "changed_by_fk": 1,
                            "changed_on": {
                                "__datetime__": "2021-09-07T08:51:52"
                            },
                            "column_name": "grpc.code",
                            "created_by_fk": 1,
                            "created_on": {
                                "__datetime__": "2021-09-07T08:51:52"
                            },
                            "description": null,
                            "expression": null,
                            "filterable": true,
                            "groupby": true,
                            "id": 49,
                            "is_active": true,
                            "is_dttm": false,
                            "python_date_format": null,
                            "table_id": 2,
                            "type": "STRING",
                            "uuid": "88feb5d5-8e2e-409f-9ff1-4fab658c3ebc",
                            "verbose_name": null
                        }
                    },
                    {
                        "__TableColumn__": {
                            "changed_by_fk": 1,
                            "changed_on": {
                                "__datetime__": "2021-09-07T08:51:52"
                            },
                            "column_name": "grpc.meta.auth_version",
                            "created_by_fk": 1,
                            "created_on": {
                                "__datetime__": "2021-09-07T08:51:52"
                            },
                            "description": null,
                            "expression": null,
                            "filterable": true,
                            "groupby": true,
                            "id": 50,
                            "is_active": true,
                            "is_dttm": false,
                            "python_date_format": null,
                            "table_id": 2,
                            "type": "STRING",
                            "uuid": "4816fb87-9430-4a6c-822d-bdd0d13e6a40",
                            "verbose_name": null
                        }
                    },
                    {
                        "__TableColumn__": {
                            "changed_by_fk": 1,
                            "changed_on": {
                                "__datetime__": "2021-09-07T08:51:52"
                            },
                            "column_name": "grpc.meta.client_name",
                            "created_by_fk": 1,
                            "created_on": {
                                "__datetime__": "2021-09-07T08:51:52"
                            },
                            "description": null,
                            "expression": null,
                            "filterable": true,
                            "groupby": true,
                            "id": 51,
                            "is_active": true,
                            "is_dttm": false,
                            "python_date_format": null,
                            "table_id": 2,
                            "type": "STRING",
                            "uuid": "30d42c7f-197e-4f36-b9f9-d11b2038e265",
                            "verbose_name": null
                        }
                    },
                    {
                        "__TableColumn__": {
                            "changed_by_fk": 1,
                            "changed_on": {
                                "__datetime__": "2021-09-07T08:51:52"
                            },
                            "column_name": "grpc.meta.deadline_type",
                            "created_by_fk": 1,
                            "created_on": {
                                "__datetime__": "2021-09-07T08:51:52"
                            },
                            "description": null,
                            "expression": null,
                            "filterable": true,
                            "groupby": true,
                            "id": 52,
                            "is_active": true,
                            "is_dttm": false,
                            "python_date_format": null,
                            "table_id": 2,
                            "type": "STRING",
                            "uuid": "41aa0401-962a-4a97-9b4a-203d1bc7d9d6",
                            "verbose_name": null
                        }
                    },
                    {
                        "__TableColumn__": {
                            "changed_by_fk": 1,
                            "changed_on": {
                                "__datetime__": "2021-09-07T08:51:52"
                            },
                            "column_name": "grpc.method",
                            "created_by_fk": 1,
                            "created_on": {
                                "__datetime__": "2021-09-07T08:51:52"
                            },
                            "description": null,
                            "expression": null,
                            "filterable": true,
                            "groupby": true,
                            "id": 53,
                            "is_active": true,
                            "is_dttm": false,
                            "python_date_format": null,
                            "table_id": 2,
                            "type": "STRING",
                            "uuid": "7d604a0b-7b1d-4aef-800c-44bcb9f48f03",
                            "verbose_name": null
                        }
                    },
                    {
                        "__TableColumn__": {
                            "changed_by_fk": 1,
                            "changed_on": {
                                "__datetime__": "2021-09-07T08:51:52"
                            },
                            "column_name": "grpc.request.deadline",
                            "created_by_fk": 1,
                            "created_on": {
                                "__datetime__": "2021-09-07T08:51:52"
                            },
                            "description": null,
                            "expression": null,
                            "filterable": true,
                            "groupby": true,
                            "id": 54,
                            "is_active": true,
                            "is_dttm": false,
                            "python_date_format": null,
                            "table_id": 2,
                            "type": "STRING",
                            "uuid": "56ee7dad-b207-4ff6-807d-f36e9919b91b",
                            "verbose_name": null
                        }
                    },
                    {
                        "__TableColumn__": {
                            "changed_by_fk": 1,
                            "changed_on": {
                                "__datetime__": "2021-09-07T08:51:52"
                            },
                            "column_name": "grpc.request.fullMethod",
                            "created_by_fk": 1,
                            "created_on": {
                                "__datetime__": "2021-09-07T08:51:52"
                            },
                            "description": null,
                            "expression": null,
                            "filterable": true,
                            "groupby": true,
                            "id": 55,
                            "is_active": true,
                            "is_dttm": false,
                            "python_date_format": null,
                            "table_id": 2,
                            "type": "STRING",
                            "uuid": "9a646740-b954-4fc3-985e-154e1899d5e8",
                            "verbose_name": null
                        }
                    },
                    {
                        "__TableColumn__": {
                            "changed_by_fk": 1,
                            "changed_on": {
                                "__datetime__": "2021-09-07T08:51:52"
                            },
                            "column_name": "grpc.request.glProjectPath",
                            "created_by_fk": 1,
                            "created_on": {
                                "__datetime__": "2021-09-07T08:51:52"
                            },
                            "description": null,
                            "expression": null,
                            "filterable": true,
                            "groupby": true,
                            "id": 56,
                            "is_active": true,
                            "is_dttm": false,
                            "python_date_format": null,
                            "table_id": 2,
                            "type": "STRING",
                            "uuid": "1b445bd5-6848-4c4c-86af-7827692d2413",
                            "verbose_name": null
                        }
                    },
                    {
                        "__TableColumn__": {
                            "changed_by_fk": 1,
                            "changed_on": {
                                "__datetime__": "2021-09-07T08:51:52"
                            },
                            "column_name": "grpc.request.glRepository",
                            "created_by_fk": 1,
                            "created_on": {
                                "__datetime__": "2021-09-07T08:51:52"
                            },
                            "description": null,
                            "expression": null,
                            "filterable": true,
                            "groupby": true,
                            "id": 57,
                            "is_active": true,
                            "is_dttm": false,
                            "python_date_format": null,
                            "table_id": 2,
                            "type": "STRING",
                            "uuid": "4893ef92-c83c-456e-853a-2a6e8f66171a",
                            "verbose_name": null
                        }
                    },
                    {
                        "__TableColumn__": {
                            "changed_by_fk": 1,
                            "changed_on": {
                                "__datetime__": "2021-09-07T08:51:52"
                            },
                            "column_name": "grpc.request.repoPath",
                            "created_by_fk": 1,
                            "created_on": {
                                "__datetime__": "2021-09-07T08:51:52"
                            },
                            "description": null,
                            "expression": null,
                            "filterable": true,
                            "groupby": true,
                            "id": 58,
                            "is_active": true,
                            "is_dttm": false,
                            "python_date_format": null,
                            "table_id": 2,
                            "type": "STRING",
                            "uuid": "8b9f6a2b-8248-448e-a64c-83b3adc01f91",
                            "verbose_name": null
                        }
                    },
                    {
                        "__TableColumn__": {
                            "changed_by_fk": 1,
                            "changed_on": {
                                "__datetime__": "2021-09-07T08:51:52"
                            },
                            "column_name": "grpc.request.repoStorage",
                            "created_by_fk": 1,
                            "created_on": {
                                "__datetime__": "2021-09-07T08:51:52"
                            },
                            "description": null,
                            "expression": null,
                            "filterable": true,
                            "groupby": true,
                            "id": 59,
                            "is_active": true,
                            "is_dttm": false,
                            "python_date_format": null,
                            "table_id": 2,
                            "type": "STRING",
                            "uuid": "f763d7d8-8c3f-43cc-a90d-35d3658b3df3",
                            "verbose_name": null
                        }
                    },
                    {
                        "__TableColumn__": {
                            "changed_by_fk": 1,
                            "changed_on": {
                                "__datetime__": "2021-09-07T08:51:52"
                            },
                            "column_name": "grpc.request.topLevelGroup",
                            "created_by_fk": 1,
                            "created_on": {
                                "__datetime__": "2021-09-07T08:51:52"
                            },
                            "description": null,
                            "expression": null,
                            "filterable": true,
                            "groupby": true,
                            "id": 60,
                            "is_active": true,
                            "is_dttm": false,
                            "python_date_format": null,
                            "table_id": 2,
                            "type": "STRING",
                            "uuid": "3af17d0f-faca-4fef-8990-892fbbce4345",
                            "verbose_name": null
                        }
                    },
                    {
                        "__TableColumn__": {
                            "changed_by_fk": 1,
                            "changed_on": {
                                "__datetime__": "2021-09-07T08:51:52"
                            },
                            "column_name": "grpc.service",
                            "created_by_fk": 1,
                            "created_on": {
                                "__datetime__": "2021-09-07T08:51:52"
                            },
                            "description": null,
                            "expression": null,
                            "filterable": true,
                            "groupby": true,
                            "id": 61,
                            "is_active": true,
                            "is_dttm": false,
                            "python_date_format": null,
                            "table_id": 2,
                            "type": "STRING",
                            "uuid": "727d5937-387b-4766-bad7-e518149df022",
                            "verbose_name": null
                        }
                    },
                    {
                        "__TableColumn__": {
                            "changed_by_fk": 1,
                            "changed_on": {
                                "__datetime__": "2021-09-07T08:51:52"
                            },
                            "column_name": "grpc.time_ms",
                            "created_by_fk": 1,
                            "created_on": {
                                "__datetime__": "2021-09-07T08:51:52"
                            },
                            "description": null,
                            "expression": null,
                            "filterable": true,
                            "groupby": true,
                            "id": 62,
                            "is_active": true,
                            "is_dttm": false,
                            "python_date_format": null,
                            "table_id": 2,
                            "type": "FLOAT",
                            "uuid": "bad5eba7-b483-486c-a90d-3b87e0af2470",
                            "verbose_name": null
                        }
                    },
                    {
                        "__TableColumn__": {
                            "changed_by_fk": 1,
                            "changed_on": {
                                "__datetime__": "2021-09-07T08:51:52"
                            },
                            "column_name": "level",
                            "created_by_fk": 1,
                            "created_on": {
                                "__datetime__": "2021-09-07T08:51:52"
                            },
                            "description": null,
                            "expression": null,
                            "filterable": true,
                            "groupby": true,
                            "id": 63,
                            "is_active": true,
                            "is_dttm": false,
                            "python_date_format": null,
                            "table_id": 2,
                            "type": "STRING",
                            "uuid": "18922898-0bc9-41c3-92f7-ca127f83f94a",
                            "verbose_name": null
                        }
                    },
                    {
                        "__TableColumn__": {
                            "changed_by_fk": 1,
                            "changed_on": {
                                "__datetime__": "2021-09-07T08:51:52"
                            },
                            "column_name": "msg",
                            "created_by_fk": 1,
                            "created_on": {
                                "__datetime__": "2021-09-07T08:51:52"
                            },
                            "description": null,
                            "expression": null,
                            "filterable": true,
                            "groupby": true,
                            "id": 64,
                            "is_active": true,
                            "is_dttm": false,
                            "python_date_format": null,
                            "table_id": 2,
                            "type": "STRING",
                            "uuid": "fa86f9bf-16e6-4d4b-8a25-4a3830e30a0f",
                            "verbose_name": null
                        }
                    },
                    {
                        "__TableColumn__": {
                            "changed_by_fk": 1,
                            "changed_on": {
                                "__datetime__": "2021-09-07T08:51:52"
                            },
                            "column_name": "peer.address",
                            "created_by_fk": 1,
                            "created_on": {
                                "__datetime__": "2021-09-07T08:51:52"
                            },
                            "description": null,
                            "expression": null,
                            "filterable": true,
                            "groupby": true,
                            "id": 65,
                            "is_active": true,
                            "is_dttm": false,
                            "python_date_format": null,
                            "table_id": 2,
                            "type": "STRING",
                            "uuid": "1c6c67e5-8776-4d01-bf60-1bfa1a3b43c5",
                            "verbose_name": null
                        }
                    },
                    {
                        "__TableColumn__": {
                            "changed_by_fk": 1,
                            "changed_on": {
                                "__datetime__": "2021-09-07T08:51:52"
                            },
                            "column_name": "pid",
                            "created_by_fk": 1,
                            "created_on": {
                                "__datetime__": "2021-09-07T08:51:52"
                            },
                            "description": null,
                            "expression": null,
                            "filterable": true,
                            "groupby": true,
                            "id": 66,
                            "is_active": true,
                            "is_dttm": false,
                            "python_date_format": null,
                            "table_id": 2,
                            "type": "LONG",
                            "uuid": "a55ba8ff-c4ab-4e1c-976c-931fde399f0b",
                            "verbose_name": null
                        }
                    },
                    {
                        "__TableColumn__": {
                            "changed_by_fk": 1,
                            "changed_on": {
                                "__datetime__": "2021-09-07T08:51:52"
                            },
                            "column_name": "remote_ip",
                            "created_by_fk": 1,
                            "created_on": {
                                "__datetime__": "2021-09-07T08:51:52"
                            },
                            "description": null,
                            "expression": null,
                            "filterable": true,
                            "groupby": true,
                            "id": 67,
                            "is_active": true,
                            "is_dttm": false,
                            "python_date_format": null,
                            "table_id": 2,
                            "type": "STRING",
                            "uuid": "704da33a-8d41-451c-83c9-cad65ae64a5c",
                            "verbose_name": null
                        }
                    },
                    {
                        "__TableColumn__": {
                            "changed_by_fk": 1,
                            "changed_on": {
                                "__datetime__": "2021-09-07T08:51:52"
                            },
                            "column_name": "service",
                            "created_by_fk": 1,
                            "created_on": {
                                "__datetime__": "2021-09-07T08:51:52"
                            },
                            "description": null,
                            "expression": null,
                            "filterable": true,
                            "groupby": true,
                            "id": 68,
                            "is_active": true,
                            "is_dttm": false,
                            "python_date_format": null,
                            "table_id": 2,
                            "type": "STRING",
                            "uuid": "0c6c641c-666c-4be8-bfe8-210a8c1ffbd0",
                            "verbose_name": null
                        }
                    },
                    {
                        "__TableColumn__": {
                            "changed_by_fk": 1,
                            "changed_on": {
                                "__datetime__": "2021-09-07T08:51:52"
                            },
                            "column_name": "span.kind",
                            "created_by_fk": 1,
                            "created_on": {
                                "__datetime__": "2021-09-07T08:51:52"
                            },
                            "description": null,
                            "expression": null,
                            "filterable": true,
                            "groupby": true,
                            "id": 69,
                            "is_active": true,
                            "is_dttm": false,
                            "python_date_format": null,
                            "table_id": 2,
                            "type": "STRING",
                            "uuid": "88970b07-91a5-4130-8a20-15b835ed2fe8",
                            "verbose_name": null
                        }
                    },
                    {
                        "__TableColumn__": {
                            "changed_by_fk": 1,
                            "changed_on": {
                                "__datetime__": "2021-09-07T08:51:52"
                            },
                            "column_name": "stream_path",
                            "created_by_fk": 1,
                            "created_on": {
                                "__datetime__": "2021-09-07T08:51:52"
                            },
                            "description": null,
                            "expression": null,
                            "filterable": true,
                            "groupby": true,
                            "id": 70,
                            "is_active": true,
                            "is_dttm": false,
                            "python_date_format": null,
                            "table_id": 2,
                            "type": "STRING",
                            "uuid": "f046b317-03d3-4161-8726-8cec6051bbd1",
                            "verbose_name": null
                        }
                    },
                    {
                        "__TableColumn__": {
                            "changed_by_fk": 1,
                            "changed_on": {
                                "__datetime__": "2021-09-07T08:51:52"
                            },
                            "column_name": "system",
                            "created_by_fk": 1,
                            "created_on": {
                                "__datetime__": "2021-09-07T08:51:52"
                            },
                            "description": null,
                            "expression": null,
                            "filterable": true,
                            "groupby": true,
                            "id": 71,
                            "is_active": true,
                            "is_dttm": false,
                            "python_date_format": null,
                            "table_id": 2,
                            "type": "STRING",
                            "uuid": "9cdd7109-c394-4e37-bb71-cb7a2f82249c",
                            "verbose_name": null
                        }
                    },
                    {
                        "__TableColumn__": {
                            "changed_by_fk": 1,
                            "changed_on": {
                                "__datetime__": "2021-09-07T08:51:52"
                            },
                            "column_name": "time",
                            "created_by_fk": 1,
                            "created_on": {
                                "__datetime__": "2021-09-07T08:51:52"
                            },
                            "description": null,
                            "expression": null,
                            "filterable": true,
                            "groupby": true,
                            "id": 72,
                            "is_active": true,
                            "is_dttm": false,
                            "python_date_format": null,
                            "table_id": 2,
                            "type": "STRING",
                            "uuid": "e950084b-4cb0-4263-9e73-ec8db3ccd511",
                            "verbose_name": null
                        }
                    },
                    {
                        "__TableColumn__": {
                            "changed_by_fk": 1,
                            "changed_on": {
                                "__datetime__": "2021-09-07T08:51:52"
                            },
                            "column_name": "username",
                            "created_by_fk": 1,
                            "created_on": {
                                "__datetime__": "2021-09-07T08:51:52"
                            },
                            "description": null,
                            "expression": null,
                            "filterable": true,
                            "groupby": true,
                            "id": 73,
                            "is_active": true,
                            "is_dttm": false,
                            "python_date_format": null,
                            "table_id": 2,
                            "type": "STRING",
                            "uuid": "506921b0-2762-4d19-8450-09df586f644f",
                            "verbose_name": null
                        }
                    }
                ],
                "database_id": 1,
                "default_endpoint": null,
                "description": null,
                "extra": null,
                "fetch_values_predicate": null,
                "filter_select_enabled": false,
                "main_dttm_col": "__time",
                "metrics": [
                    {
                        "__SqlMetric__": {
                            "changed_by_fk": 1,
                            "changed_on": {
                                "__datetime__": "2021-09-07T08:51:52"
                            },
                            "created_by_fk": 1,
                            "created_on": {
                                "__datetime__": "2021-09-07T08:51:52"
                            },
                            "d3format": null,
                            "description": null,
                            "expression": "COUNT(*)",
                            "extra": null,
                            "id": 2,
                            "metric_name": "count",
                            "metric_type": "count",
                            "table_id": 2,
                            "uuid": "b01c2225-5958-4fa3-8c00-2c93dace717e",
                            "verbose_name": "COUNT(*)",
                            "warning_text": null
                        }
                    }
                ],
                "offset": 0,
                "params": "{\"remote_id\": 2, \"database_name\": \"Druid\", \"import_time\": 1631004713}",
                "schema": "druid",
                "sql": null,
                "table_name": "gitaly",
                "template_params": null
            }
        }
    ]
}