{
	"env_name": "Dade Murphy Omnibus Sandbox Environment",
	"env_prefix": "dmurphy-",
	"gcp_dns_zone_fqdn": "omnibus.mydomain.tld.",
	"gcp_project": "my-project-name-a1b2c3d4",
	"gcp_region": "us-central1",
	"gcp_region_zone": "us-central1-c",
	"gitlab_ci_cluster_ingress" : {
		"enabled" : "false",
	    "external_ip" : "1.2.3.4"
	},
	"gitlab_ci_cluster_letsencrypt_txt" : {
		"enabled" : "false",
	    "value" : "placeholder"
	},
}
