<svg width="140" height="34" viewBox="0 0 140 34" fill="none" xmlns="http://www.w3.org/2000/svg">
<path d="M71.4076 2.82066H70.8042C70.1996 2.82066 69.7073 3.3111 69.7073 3.91352V28.5082C69.7073 29.1099 70.1996 29.601 70.8042 29.601H71.4076C72.0123 29.601 72.5051 29.1099 72.5051 28.5082V3.91352C72.5051 3.3111 72.0123 2.82066 71.4076 2.82066ZM52.7559 5.89218H52.1525C51.5479 5.89218 51.0556 6.38262 51.0556 6.98504V25.436C51.0556 26.0384 51.5479 26.5289 52.1525 26.5289H52.7559C53.3612 26.5289 53.8534 26.0384 53.8534 25.436V6.98504C53.8534 6.38262 53.3612 5.89218 52.7559 5.89218ZM62.0818 0H61.479C60.8737 0 60.3815 0.490441 60.3815 1.09348V31.3282C60.3815 31.9306 60.8737 32.4211 61.479 32.4211H62.0818C62.687 32.4211 63.1793 31.9306 63.1793 31.3282V1.09348C63.1793 0.490441 62.687 0 62.0818 0ZM66.745 5.38109H66.1416C65.5363 5.38109 65.0441 5.87153 65.0441 6.47395V25.9477C65.0441 26.5501 65.5363 27.0406 66.1416 27.0406H66.745C67.3496 27.0406 67.8419 26.5501 67.8419 25.9477V6.47395C67.8419 5.87153 67.3496 5.38109 66.745 5.38109ZM57.4191 3.58886H56.8158C56.2105 3.58886 55.7188 4.0793 55.7188 4.68234V27.74C55.7188 28.3424 56.2105 28.8328 56.8158 28.8328H57.4191C58.0244 28.8328 58.516 28.3424 58.516 27.74V4.68234C58.516 4.0793 58.0244 3.58886 57.4191 3.58886ZM76.0708 9.92581H75.4668C74.8622 9.92581 74.3699 10.4169 74.3699 11.0193V21.4024C74.3699 22.0048 74.8622 22.4952 75.4668 22.4952H76.0708C76.6755 22.4952 77.1677 22.0048 77.1677 21.4024V11.0193C77.1677 10.4169 76.6755 9.92581 76.0708 9.92581ZM48.0933 9.92581H47.4899C46.8853 9.92581 46.393 10.4169 46.393 11.0193V21.4024C46.393 22.0048 46.8853 22.4952 47.4899 22.4952H48.0933C48.6986 22.4952 49.1908 22.0048 49.1908 21.4024V11.0193C49.1908 10.4169 48.6986 9.92581 48.0933 9.92581ZM133.161 13.7664C131.021 12.9029 130.148 12.1533 130.148 11.1794C130.148 10.4934 130.864 9.93479 131.745 9.93479C133.201 9.93479 134.972 11.1091 135.553 11.4947C135.659 11.5655 135.735 11.6146 135.743 11.6164C135.878 11.7204 136.053 11.7578 136.252 11.7227C136.558 11.67 136.888 11.4488 137.054 11.1889L138.537 8.95684C138.705 8.66539 138.763 8.00591 138.302 7.74014C137.174 6.9167 134.853 5.53468 131.976 5.53468C128.542 5.53468 125.067 7.58248 125.067 11.4965C125.067 15.0615 128.197 17.0426 130.822 18.0769C132.758 18.8427 133.66 19.7013 133.66 20.7792C133.66 21.6648 132.932 22.2833 131.889 22.2833C131.145 22.2833 129.867 22.0261 128.011 20.8031C127.94 20.7558 127.902 20.7324 127.911 20.7391C127.725 20.6071 127.422 20.554 127.155 20.608C126.915 20.6562 126.724 20.7842 126.6 20.9851L125.24 23.3775C124.935 23.9099 125.106 24.1397 125.422 24.455C125.805 24.837 127.925 26.7406 132.092 26.7406C136.508 26.7406 139.146 23.5923 139.146 20.5481C139.146 16.1376 134.64 14.3529 133.161 13.7664ZM119.697 5.67883H116.138C115.71 5.67883 115.363 6.02568 115.363 6.45182V18.1269C115.363 20.0693 113.905 21.5342 111.972 21.5342C110.071 21.5342 108.639 20.0693 108.639 18.1269V6.45182C108.639 6.02568 108.291 5.67883 107.863 5.67883H104.304C103.891 5.67883 103.528 6.0401 103.528 6.45182V18.358C103.528 22.9009 107.316 26.5969 111.972 26.5969C116.659 26.5969 120.473 22.9009 120.473 18.358V6.45182C120.473 6.0401 120.11 5.67883 119.697 5.67883ZM94.3921 12.361C94.3921 11.2956 93.4887 10.3956 92.419 10.3956H88.363V14.4421H92.419C93.4702 14.4421 94.3921 13.4696 94.3921 12.361ZM95.1381 18.1809L98.9839 25.2847C99.1236 25.5437 99.1222 25.8514 98.9807 26.0874C98.8415 26.3194 98.5905 26.4528 98.293 26.4528H94.4445C94.1199 26.4528 93.8721 26.2532 93.779 26.0685L89.9938 18.5535H88.363V25.6798C88.363 26.0915 88.0004 26.4528 87.5871 26.4528H84.1441C83.716 26.4528 83.3683 26.1059 83.3683 25.6798V6.59552C83.3683 6.16938 83.716 5.82298 84.1441 5.82298H92.7956C96.3977 5.82298 99.3289 8.71719 99.3289 12.2749C99.3289 14.8092 97.7301 17.0516 95.1381 18.1809ZM39.4595 5.82298H36.0165C35.5883 5.82298 35.2407 6.16938 35.2407 6.59552V13.6349H27.4175V6.59552C27.4175 6.16938 27.0698 5.82298 26.6416 5.82298H23.1987C22.7854 5.82298 22.4228 6.1838 22.4228 6.59552V25.6798C22.4228 26.0915 22.7854 26.4528 23.1987 26.4528H26.6416C27.0698 26.4528 27.4175 26.1059 27.4175 25.6798V18.3233H35.2407V25.6798C35.2407 26.1059 35.5883 26.4528 36.0165 26.4528H39.4595C39.8727 26.4528 40.2353 26.0915 40.2353 25.6798V6.59552C40.2353 6.1838 39.8727 5.82298 39.4595 5.82298ZM5.37083 16.0512C5.37083 19.2066 7.77524 21.6779 10.8447 21.6779C12.2102 21.6779 13.6045 21.181 14.5743 20.349C14.8777 20.0896 15.3981 20.1143 15.6459 20.4013L17.8957 22.7865C18.1764 23.0662 18.1629 23.5788 17.8618 23.8788C15.9248 25.7519 13.4391 26.7406 10.6711 26.7406C4.78713 26.7406 0 21.9973 0 16.1669C0 10.3042 4.78713 5.53468 10.6711 5.53468C13.5335 5.53468 15.7399 6.37975 17.8256 8.27439C17.9942 8.42349 18.0919 8.6235 18.0982 8.83566C18.1041 9.04648 18.0205 9.24964 17.8613 9.4073L15.6084 11.7389C15.4646 11.8826 15.2792 11.9596 15.0834 11.9596H15.083C14.8872 11.9596 14.7023 11.8821 14.5621 11.742C13.5607 10.8533 12.1916 10.338 10.8158 10.338C7.76258 10.338 5.37083 12.8475 5.37083 16.0512Z" fill="white"/>
</svg>
