<svg width="930" height="693" viewBox="0 0 930 693" fill="none" xmlns="http://www.w3.org/2000/svg">
<g clip-path="url(#clip0_497_766)">
<g clip-path="url(#clip1_497_766)">
<path opacity="0.6" d="M729.904 639.911C891.774 639.911 1022.99 508.663 1022.99 346.76C1022.99 184.858 891.774 53.6099 729.904 53.6099C568.035 53.6099 436.814 184.858 436.814 346.76C436.814 508.663 568.035 639.911 729.904 639.911Z" stroke="#2F2A6B" stroke-width="2" stroke-miterlimit="10"/>
<path opacity="0.5" d="M729.905 692.259C920.679 692.259 1075.33 537.574 1075.33 346.76C1075.33 155.947 920.679 1.26172 729.905 1.26172C539.13 1.26172 384.477 155.947 384.477 346.76C384.477 537.574 539.13 692.259 729.905 692.259Z" stroke="#2F2A6B" stroke-width="2" stroke-miterlimit="10"/>
<path opacity="0.7" d="M729.905 587.563C862.869 587.563 970.658 479.752 970.658 346.761C970.658 213.769 862.869 105.958 729.905 105.958C596.941 105.958 489.152 213.769 489.152 346.761C489.152 479.752 596.941 587.563 729.905 587.563Z" stroke="#2F2A6B" stroke-width="2" stroke-miterlimit="10"/>
<path opacity="0.8" d="M729.905 535.214C833.963 535.214 918.32 450.841 918.32 346.76C918.32 242.68 833.963 158.307 729.905 158.307C625.846 158.307 541.489 242.68 541.489 346.76C541.489 450.841 625.846 535.214 729.905 535.214Z" stroke="#2F2A6B" stroke-width="2" stroke-miterlimit="10"/>
<path d="M729.905 484.96C806.214 484.96 868.076 423.086 868.076 346.76C868.076 270.435 806.214 208.561 729.905 208.561C653.595 208.561 591.733 270.435 591.733 346.76C591.733 423.086 653.595 484.96 729.905 484.96Z" stroke="#2F2A6B" stroke-width="2" stroke-miterlimit="10"/>
<path d="M570.04 474.017H617.432" stroke="#2F2A6B" stroke-width="8" stroke-miterlimit="10"/>
<path d="M683.514 473.35H692.544C699.353 473.35 704.873 478.795 704.873 485.513V512.74" stroke="#2F2A6B" stroke-width="8" stroke-miterlimit="10"/>
<path d="M665.021 454.656H633.922C623.34 454.656 614.762 463.175 614.762 473.683C614.762 484.192 623.34 492.711 633.922 492.711H665.021C675.603 492.711 684.181 484.192 684.181 473.683C684.181 463.175 675.603 454.656 665.021 454.656Z" fill="#F8A868"/>
<path d="M647.598 466.617L641.434 472.538C640.581 473.354 640.581 474.678 641.434 475.497L647.598 481.417C648.447 482.233 649.827 482.233 650.68 481.417L656.844 475.497C657.694 474.681 657.694 473.357 656.844 472.538L650.68 466.617C649.827 465.802 648.447 465.802 647.598 466.617Z" fill="white"/>
<path d="M813.685 96.1387H698.188C687.503 96.1387 678.841 104.657 678.841 115.166C678.841 125.675 687.503 134.194 698.188 134.194H813.685C824.371 134.194 833.032 125.675 833.032 115.166C833.032 104.657 824.371 96.1387 813.685 96.1387Z" fill="#2F2A6B"/>
<path d="M772.542 110.159H699.281C696.102 110.159 693.526 112.55 693.526 115.5C693.526 118.451 696.102 120.841 699.281 120.841H772.542C775.721 120.841 778.298 118.451 778.298 115.5C778.298 112.55 775.721 110.159 772.542 110.159Z" fill="#9B80E7"/>
<path d="M812.674 129.52C820.602 129.52 827.025 122.943 827.025 114.832C827.025 106.722 820.598 100.145 812.674 100.145C804.749 100.145 798.323 106.722 798.323 114.832C798.323 122.943 804.749 129.52 812.674 129.52Z" fill="white"/>
<path d="M733.29 528.095H717.174C711.854 528.095 707.543 532.427 707.543 537.774C707.543 543.124 711.854 547.456 717.174 547.456H733.29C738.61 547.456 742.921 543.124 742.921 537.778C742.921 532.428 738.61 528.095 733.29 528.095Z" fill="#6FCCBB"/>
<path d="M723.375 501.39H687.707C682.441 501.39 678.174 505.722 678.174 511.069C678.174 516.419 682.441 520.751 687.707 520.751H723.375C728.641 520.751 732.908 516.419 732.908 511.073C732.908 505.722 728.641 501.39 723.375 501.39Z" fill="#7759B4"/>
<path d="M906.191 447.312H813.941C808.632 447.312 804.33 451.644 804.33 456.991C804.33 462.341 808.632 466.673 813.941 466.673H906.191C911.5 466.673 915.802 462.341 915.802 456.994C915.802 451.644 911.5 447.312 906.191 447.312Z" fill="#6FCCBB"/>
<path d="M933.494 474.017H888.096C882.752 474.017 878.422 478.35 878.422 483.696C878.422 489.046 882.752 493.379 888.096 493.379H933.494C938.838 493.379 943.169 489.046 943.169 483.7C943.169 478.35 938.838 474.017 933.494 474.017Z" fill="#7759B4"/>
<path d="M441.419 116.167H348.617C343.276 116.167 338.948 120.5 338.948 125.846C338.948 131.197 343.276 135.529 348.617 135.529H441.419C446.76 135.529 451.087 131.196 451.087 125.85C451.087 120.5 446.76 116.167 441.419 116.167Z" fill="url(#paint0_linear_497_766)"/>
<path d="M468.78 143.541H423.381C418.037 143.541 413.707 147.873 413.707 153.219C413.707 158.57 418.037 162.902 423.381 162.902H468.78C474.124 162.902 478.454 158.569 478.454 153.223C478.454 147.873 474.124 143.541 468.78 143.541Z" fill="#6FCCBB"/>
<path d="M266.139 474.017H260.741V472.014H266.139V474.017ZM255.702 474.017H250.303V472.014H255.702V474.017ZM245.264 474.017H239.865V472.014H245.264V474.017ZM234.826 474.017H229.427V472.014H234.826V474.017Z" fill="#2F2A6B"/>
<path d="M192.238 491.376C202.559 491.376 210.928 483.005 210.928 472.682C210.928 462.359 202.559 453.989 192.238 453.989C181.917 453.989 173.548 462.359 173.548 472.682C173.548 483.005 181.917 491.376 192.238 491.376Z" stroke="#2F2A6B" stroke-width="2" stroke-miterlimit="10"/>
<path d="M210.928 491.376C221.249 491.376 229.618 483.005 229.618 472.682C229.618 462.359 221.249 453.989 210.928 453.989C200.607 453.989 192.238 462.359 192.238 472.682C192.238 483.005 200.607 491.376 210.928 491.376Z" fill="#9B80E7"/>
<path d="M769.954 388.023L764.109 379.204C759.085 372.371 751.919 368.05 743.44 368.05H723.471C715.117 368.05 707.292 372.62 702.254 379.286L696.013 388.023C696.013 388.023 710.829 402.732 733.455 403.002C756.082 403.273 769.954 388.023 769.954 388.023Z" fill="#2F2A6B" stroke="#2F2A6B" stroke-width="8" stroke-miterlimit="10"/>
<path d="M733.452 355.569C743.792 355.569 752.175 347.185 752.175 336.842C752.175 326.5 743.792 318.115 733.452 318.115C723.111 318.115 714.729 326.5 714.729 336.842C714.729 347.185 723.111 355.569 733.452 355.569Z" fill="#2F2A6B" stroke="#2F2A6B" stroke-width="8" stroke-miterlimit="10"/>
<path d="M733.452 403.002C765.849 403.002 792.112 376.734 792.112 344.33C792.112 311.927 765.849 285.658 733.452 285.658C701.055 285.658 674.792 311.927 674.792 344.33C674.792 376.734 701.055 403.002 733.452 403.002Z" stroke="#2F2A6B" stroke-width="5" stroke-miterlimit="10"/>
<path d="M665.665 281.74H623.376C602.411 281.74 585.392 298.762 585.392 319.731C585.392 340.7 602.411 357.722 623.376 357.722H703.648V319.731C703.648 298.762 686.63 281.74 665.665 281.74ZM623.208 326.038C619.725 326.038 616.903 323.215 616.903 319.731C616.903 316.247 619.725 313.425 623.208 313.425C626.692 313.425 629.514 316.247 629.514 319.731C629.514 323.215 626.692 326.038 623.208 326.038ZM644.518 326.038C641.035 326.038 638.213 323.215 638.213 319.731C638.213 316.247 641.035 313.425 644.518 313.425C648.002 313.425 650.824 316.247 650.824 319.731C650.824 323.215 648.002 326.038 644.518 326.038ZM665.828 326.038C662.345 326.038 659.523 323.215 659.523 319.731C659.523 316.247 662.345 313.425 665.828 313.425C669.312 313.425 672.133 316.247 672.133 319.731C672.133 323.215 669.308 326.038 665.828 326.038Z" fill="url(#paint1_linear_497_766)"/>
<path d="M812.626 114.495C814.8 114.495 816.562 112.733 816.562 110.559C816.562 108.385 814.8 106.623 812.626 106.623C810.453 106.623 808.691 108.385 808.691 110.559C808.691 112.733 810.453 114.495 812.626 114.495Z" fill="#2F2A6B"/>
<path d="M814.975 117.189H810.278C808.314 117.189 806.474 118.264 805.289 119.83L804.286 121.236C806.083 123.635 808.89 125.233 812.079 125.393C812.267 125.4 812.456 125.407 812.648 125.407C816.021 125.396 819.017 123.781 820.91 121.286L819.839 119.812C818.658 118.204 816.971 117.189 814.978 117.189H814.975Z" fill="#2F2A6B"/>
<path d="M965.196 236.341H914.191C907.339 236.341 901.784 230.748 901.784 223.85V168.243" stroke="#2F2A6B" stroke-width="7" stroke-miterlimit="10"/>
<path d="M938.496 245.02C943.289 245.02 947.174 241.284 947.174 236.675C947.174 232.066 943.289 228.33 938.496 228.33C933.704 228.33 929.819 232.066 929.819 236.675C929.819 241.284 933.704 245.02 938.496 245.02Z" fill="white" stroke="#2F2A6B" stroke-width="7" stroke-miterlimit="10"/>
<path d="M807.667 168.243H848.385" stroke="#2F2A6B" stroke-width="7" stroke-miterlimit="10"/>
<path d="M617.373 148.881H792.373C803.025 148.881 811.672 157.557 811.672 168.243C811.672 178.929 803.025 187.604 792.373 187.604H598.074V168.243C598.074 157.557 606.722 148.881 617.373 148.881Z" fill="#9B80E7"/>
<path d="M945.92 148.881H859.651C849.005 148.881 840.375 157.55 840.375 168.243C840.375 178.936 849.005 187.604 859.651 187.604H945.92C956.566 187.604 965.196 178.936 965.196 168.243C965.196 157.55 956.566 148.881 945.92 148.881Z" fill="#2F2A6B"/>
<path d="M912.931 197.619H891.305C886.033 197.619 881.759 201.952 881.759 207.297V207.301C881.759 212.647 886.033 216.98 891.305 216.98H912.931C918.203 216.98 922.476 212.647 922.476 207.301V207.297C922.476 201.952 918.203 197.619 912.931 197.619Z" fill="#7759B4"/>
<path d="M745.214 162.902H619.143C615.986 162.902 613.427 165.443 613.427 168.577C613.427 171.711 615.986 174.252 619.143 174.252H745.214C748.371 174.252 750.93 171.711 750.93 168.577C750.93 165.443 748.371 162.902 745.214 162.902Z" fill="#171321"/>
<path d="M792.649 182.931C800.575 182.931 807 176.504 807 168.577C807 160.649 800.575 154.223 792.649 154.223C784.723 154.223 778.298 160.649 778.298 168.577C778.298 176.504 784.723 182.931 792.649 182.931Z" fill="white"/>
<path d="M901.117 177.59C905.909 177.59 909.794 173.704 909.794 168.911C909.794 164.117 905.909 160.231 901.117 160.231C896.324 160.231 892.439 164.117 892.439 168.911C892.439 173.704 896.324 177.59 901.117 177.59Z" fill="#F8A868"/>
<path d="M949.363 207.633C949.363 206.897 949.916 206.298 950.604 206.298C951.289 206.298 951.846 206.897 951.846 207.633C951.846 208.369 951.289 208.968 950.604 208.968C949.916 208.968 949.363 208.369 949.363 207.633ZM941.511 207.633C941.511 206.897 942.068 206.298 942.752 206.298C943.441 206.298 943.994 206.897 943.994 207.633C943.994 208.369 943.441 208.968 942.752 208.968C942.068 208.968 941.511 208.369 941.511 207.633ZM933.662 207.633C933.662 206.897 934.219 206.298 934.904 206.298C935.589 206.298 936.146 206.897 936.146 207.633C936.146 208.369 935.589 208.968 934.904 208.968C934.219 208.968 933.662 208.369 933.662 207.633ZM925.814 207.633C925.814 206.897 926.367 206.298 927.056 206.298C927.741 206.298 928.298 206.897 928.298 207.633C928.298 208.369 927.741 208.968 927.056 208.968C926.367 208.968 925.814 208.369 925.814 207.633Z" fill="#2F2A6B"/>
<path d="M210.867 472.686C213.213 472.686 215.115 470.783 215.115 468.436C215.115 466.089 213.213 464.187 210.867 464.187C208.52 464.187 206.618 466.089 206.618 468.436C206.618 470.783 208.52 472.686 210.867 472.686Z" fill="#2F2A6B"/>
<path d="M213.404 475.597H208.333C206.212 475.597 204.227 476.757 202.946 478.451L201.861 479.967C203.8 482.558 206.835 484.281 210.276 484.459C210.479 484.466 210.685 484.473 210.888 484.473C214.532 484.462 217.766 482.718 219.808 480.021L218.648 478.43C217.371 476.693 215.553 475.597 213.4 475.597H213.404Z" fill="#2F2A6B"/>
<path d="M501.294 453.989H580.713C591.401 453.989 600.077 462.664 600.077 473.35V492.711H501.294C490.607 492.711 481.931 484.036 481.931 473.35C481.931 462.664 490.607 453.989 501.294 453.989Z" fill="#2F2A6B"/>
<path d="M578.289 467.341H531.085C527.9 467.341 525.317 470.031 525.317 473.35C525.317 476.668 527.9 479.358 531.085 479.358H578.289C581.475 479.358 584.057 476.668 584.057 473.35C584.057 470.031 581.475 467.341 578.289 467.341Z" fill="#171321"/>
<path d="M448.104 453.321H284.804C273.864 453.321 264.995 462.139 264.995 473.016C264.995 483.893 273.864 492.711 284.804 492.711H448.104C459.044 492.711 467.913 483.893 467.913 473.016C467.913 462.139 459.044 453.321 448.104 453.321Z" stroke="#2F2A6B" stroke-width="4" stroke-miterlimit="10"/>
<path d="M444.074 467H284.926C281.101 467 278 469.685 278 472.998V473.002C278 476.315 281.101 479 284.926 479H444.074C447.899 479 451 476.315 451 473.002V472.998C451 469.685 447.899 467 444.074 467Z" fill="#6FCCBB"/>
<path d="M450.558 528.095H378.932C372.041 528.095 366.454 522.47 366.454 515.53V492.711" stroke="#2F2A6B" stroke-width="7" stroke-miterlimit="10"/>
<path d="M520.142 507.399H420.357C409.757 507.399 401.164 516.067 401.164 526.76C401.164 537.453 409.757 546.121 420.357 546.121H520.142C530.742 546.121 539.335 537.453 539.335 526.76C539.335 516.067 530.742 507.399 520.142 507.399Z" fill="#2F2A6B"/>
<path d="M483.509 531.646C485.539 531.646 487.184 530 487.184 527.969C487.184 525.939 485.539 524.293 483.509 524.293C481.479 524.293 479.833 525.939 479.833 527.969C479.833 530 481.479 531.646 483.509 531.646Z" fill="#9B80E7"/>
<path d="M462.971 531.646C465.001 531.646 466.647 530 466.647 527.969C466.647 525.939 465.001 524.293 462.971 524.293C460.941 524.293 459.295 525.939 459.295 527.969C459.295 530 460.941 531.646 462.971 531.646Z" fill="#9B80E7"/>
<path d="M442.429 531.646C444.459 531.646 446.105 530 446.105 527.969C446.105 525.939 444.459 524.293 442.429 524.293C440.4 524.293 438.754 525.939 438.754 527.969C438.754 530 440.4 531.646 442.429 531.646Z" fill="#9B80E7"/>
<path d="M504.05 531.646C506.08 531.646 507.726 530 507.726 527.969C507.726 525.939 506.08 524.293 504.05 524.293C502.02 524.293 500.375 525.939 500.375 527.969C500.375 530 502.02 531.646 504.05 531.646Z" fill="#9B80E7"/>
<path d="M678.841 115.5H661.165C654.338 115.5 648.804 120.983 648.804 127.747V148.882" stroke="#2F2A6B" stroke-width="8" stroke-miterlimit="10"/>
<path d="M800.325 168.573C800.325 173.551 796.473 177.589 791.716 177.589C788.563 177.589 785.807 175.813 784.305 173.165L791.706 167.987L791.716 159.563C796.469 159.563 800.325 163.598 800.325 168.58V168.573Z" fill="#2F2A6B"/>
</g>
</g>
<defs>
<linearGradient id="paint0_linear_497_766" x1="279.278" y1="113.594" x2="468.368" y2="164.247" gradientUnits="userSpaceOnUse">
<stop stop-color="#855FE0"/>
<stop offset="0.5" stop-color="#C8A0EC"/>
<stop offset="1" stop-color="#FFBE8A"/>
</linearGradient>
<linearGradient id="paint1_linear_497_766" x1="522.467" y1="271.64" x2="735.079" y2="286.944" gradientUnits="userSpaceOnUse">
<stop stop-color="#855FE0"/>
<stop offset="0.5" stop-color="#C8A0EC"/>
<stop offset="1" stop-color="#FFBE8A"/>
</linearGradient>
<clipPath id="clip0_497_766">
<rect width="930" height="693" fill="white"/>
</clipPath>
<clipPath id="clip1_497_766">
<rect width="1076" height="693" fill="white"/>
</clipPath>
</defs>
</svg>
