<svg width="266" height="24" viewBox="0 0 266 24" fill="none" xmlns="http://www.w3.org/2000/svg">
<path d="M129.854 14.1989H129.315C129.205 14.1989 129.125 14.1806 129.073 14.1439C129.029 14.0999 128.985 14.0156 128.941 13.8909L127.313 9.02843C127.284 8.94776 127.265 8.89275 127.258 8.86342C127.251 8.83408 127.247 8.80474 127.247 8.77541C127.247 8.67273 127.302 8.62139 127.412 8.62139H128.039C128.157 8.62139 128.237 8.64339 128.281 8.6874C128.333 8.72407 128.377 8.80474 128.413 8.92942L129.612 13.0878L130.712 8.92942C130.749 8.80474 130.789 8.72407 130.833 8.6874C130.885 8.64339 130.969 8.62139 131.087 8.62139H131.593C131.71 8.62139 131.794 8.64339 131.846 8.6874C131.897 8.72407 131.937 8.80474 131.967 8.92942L133.078 13.1428L134.31 8.92942C134.346 8.80474 134.387 8.72407 134.431 8.6874C134.482 8.64339 134.567 8.62139 134.684 8.62139H135.278C135.388 8.62139 135.443 8.67273 135.443 8.77541C135.443 8.80474 135.439 8.83408 135.432 8.86342C135.425 8.89275 135.406 8.94776 135.377 9.02843L133.705 13.8909C133.661 14.0156 133.613 14.0999 133.562 14.1439C133.518 14.1806 133.441 14.1989 133.331 14.1989H132.792C132.674 14.1989 132.59 14.1769 132.539 14.1329C132.495 14.0816 132.454 13.9973 132.418 13.8799L131.318 9.83151L130.228 13.8799C130.199 13.9973 130.159 14.0816 130.107 14.1329C130.056 14.1769 129.972 14.1989 129.854 14.1989Z" fill="white"/>
<path d="M136.978 7.6313C136.773 7.6313 136.608 7.57262 136.483 7.45528C136.358 7.33793 136.296 7.17658 136.296 6.97123C136.296 6.76588 136.358 6.60453 136.483 6.48718C136.608 6.36984 136.773 6.31117 136.978 6.31117C137.191 6.31117 137.356 6.36984 137.473 6.48718C137.598 6.60453 137.66 6.76588 137.66 6.97123C137.66 7.17658 137.598 7.33793 137.473 7.45528C137.356 7.57262 137.191 7.6313 136.978 7.6313ZM136.648 14.1989C136.501 14.1989 136.428 14.1256 136.428 13.9789V8.84141C136.428 8.69473 136.501 8.62139 136.648 8.62139H137.297C137.444 8.62139 137.517 8.69473 137.517 8.84141V13.9789C137.517 14.1256 137.444 14.1989 137.297 14.1989H136.648Z" fill="white"/>
<path d="M141.102 14.2759C140.061 14.2759 139.54 13.7552 139.54 12.7138V9.47948H138.748C138.601 9.47948 138.528 9.40613 138.528 9.25945V8.98443C138.528 8.84508 138.609 8.76441 138.77 8.7424L139.573 8.64339L139.716 7.27926C139.731 7.13258 139.808 7.05924 139.947 7.05924H140.409C140.556 7.05924 140.629 7.13258 140.629 7.27926V8.62139H142.059C142.206 8.62139 142.279 8.69473 142.279 8.84141V9.25945C142.279 9.40613 142.206 9.47948 142.059 9.47948H140.629V12.6588C140.629 12.9301 140.688 13.1208 140.805 13.2308C140.93 13.3409 141.139 13.3959 141.432 13.3959C141.572 13.3959 141.744 13.3775 141.949 13.3409C142.03 13.3262 142.081 13.3189 142.103 13.3189C142.133 13.3115 142.155 13.3078 142.169 13.3078C142.272 13.3078 142.323 13.3775 142.323 13.5169V13.8139C142.323 13.9092 142.305 13.9826 142.268 14.0339C142.239 14.0779 142.184 14.1146 142.103 14.1439C141.817 14.2319 141.484 14.2759 141.102 14.2759Z" fill="white"/>
<path d="M144.269 14.1989H143.619C143.473 14.1989 143.399 14.1256 143.399 13.9789V6.27816C143.399 6.13148 143.473 6.05814 143.619 6.05814H144.269C144.415 6.05814 144.489 6.13148 144.489 6.27816V9.19345C144.826 8.95876 145.174 8.77907 145.534 8.6544C145.9 8.52238 146.263 8.45638 146.623 8.45638C147.158 8.45638 147.565 8.59939 147.844 8.88542C148.123 9.16411 148.262 9.57115 148.262 10.1065V13.9789C148.262 14.1256 148.189 14.1989 148.042 14.1989H147.393C147.246 14.1989 147.173 14.1256 147.173 13.9789V10.4696C147.173 10.0809 147.092 9.79484 146.931 9.61149C146.777 9.42814 146.531 9.33646 146.194 9.33646C145.9 9.33646 145.611 9.38413 145.325 9.47948C145.039 9.57482 144.76 9.71417 144.489 9.89752V13.9789C144.489 14.1256 144.415 14.1989 144.269 14.1989Z" fill="white"/>
<path d="M37.6528 9.93463H40.6905C40.1838 6.70487 37.3888 4.45524 33.7483 4.45524C29.4411 4.45524 26.2113 7.62099 26.2113 12.9243C26.2113 18.2277 29.297 21.3615 33.8363 21.3615C37.9102 21.3615 40.8265 18.7424 40.8265 14.4992V12.523H34.1497V14.8526H37.9422C37.8942 17.1982 36.3273 18.6851 33.8523 18.6851C31.0959 18.6851 29.2077 16.6208 29.2077 12.8923C29.2077 9.16386 31.1279 7.13159 33.787 7.13159C35.7712 7.13159 37.1207 8.19173 37.6515 9.93596L37.6528 9.93463Z" fill="white"/>
<path d="M42.8328 21.1347H45.7412V8.79308H42.8328V21.1347ZM44.2957 6.8395C45.2198 6.8395 45.9745 6.13274 45.9745 5.26462C45.9745 4.39651 45.2198 3.68175 44.2957 3.68175C43.3715 3.68175 42.6088 4.38851 42.6088 5.26462C42.6088 6.14074 43.3635 6.8395 44.2957 6.8395Z" fill="white"/>
<path d="M54.4522 8.79326H52.0172V5.83688H49.1089V8.79326H47.3566V11.0429H49.1089V17.9051C49.0929 20.2268 50.7798 21.3682 52.9654 21.3042C53.7935 21.2802 54.3629 21.1189 54.6763 21.0149L54.1869 18.7412C54.0255 18.7812 53.6961 18.8532 53.3348 18.8532C52.604 18.8532 52.0172 18.5959 52.0172 17.4237V11.0442H54.4522V8.79326Z" fill="white"/>
<path d="M56.7029 21.1347H66.9309V18.6357H59.6833V4.67922H56.7029V21.1347Z" fill="white"/>
<path d="M72.5013 21.3842C74.4375 21.3842 75.595 20.4761 76.1244 19.4399H76.2204V21.1348H79.0168V12.8751C79.0168 9.61331 76.3578 8.63318 74.0028 8.63318C71.4078 8.63318 69.4155 9.79066 68.7714 12.0403L71.4878 12.4257C71.7772 11.5816 72.5959 10.8588 74.0188 10.8588C75.4416 10.8588 76.1084 11.5496 76.1084 12.7631V12.8111C76.1084 13.6472 75.2323 13.6872 73.0547 13.9192C70.6597 14.1766 68.37 14.8913 68.37 17.6717C68.37 20.0987 70.1463 21.3842 72.4999 21.3842H72.5013ZM73.4574 19.2466C72.2439 19.2466 71.3758 18.6918 71.3758 17.6237C71.3758 16.5555 72.3479 16.0408 73.6494 15.8555C74.4122 15.7514 75.939 15.5581 76.3164 15.2527V16.7076C76.3164 18.0811 75.2069 19.2466 73.456 19.2466H73.4574Z" fill="white"/>
<path d="M81.1634 21.1346H84.0238V19.1903H84.1931C84.6518 20.0904 85.6079 21.3519 87.7282 21.3519C90.6366 21.3519 92.8142 19.0463 92.8142 14.9804C92.8142 10.9146 90.5726 8.63295 87.7202 8.63295C85.5426 8.63295 84.6345 9.94245 84.1931 10.8346H84.0731V4.68043H81.1647V21.1359L81.1634 21.1346ZM84.0157 14.9644C84.0157 12.5695 85.0439 11.0199 86.9161 11.0199C88.7884 11.0199 89.8485 12.6668 89.8485 14.9644C89.8485 17.2621 88.8364 18.9663 86.9161 18.9663C84.9959 18.9663 84.0157 17.3594 84.0157 14.9644Z" fill="white"/>
<path d="M20.7208 10.3158L20.6928 10.2411L17.8658 2.86551C17.8097 2.7215 17.7071 2.59881 17.575 2.5148C17.443 2.43079 17.2883 2.39079 17.1323 2.39879C16.9763 2.40679 16.827 2.46413 16.7043 2.56147C16.5829 2.66015 16.4949 2.79217 16.4549 2.94152L14.5467 8.78362H6.82431L4.91606 2.94152C4.87473 2.79217 4.78671 2.65882 4.6667 2.56147C4.54402 2.46413 4.39466 2.40679 4.23864 2.39879C4.08129 2.39079 3.92794 2.43079 3.79592 2.5148C3.6639 2.59881 3.56255 2.72016 3.50521 2.86551L0.678179 10.2411L0.650174 10.3145C-0.187268 12.5001 0.526158 14.9698 2.39174 16.3806C2.39574 16.3833 2.3984 16.386 2.4024 16.3886L2.42774 16.4073L6.73364 19.6304L10.1594 22.2227C10.4715 22.4587 10.9035 22.4587 11.2156 22.2227L14.6413 19.6304L18.9726 16.3873C18.9726 16.3873 18.9806 16.382 18.9846 16.378C20.8488 14.9671 21.5622 12.4974 20.7248 10.3132L20.7208 10.3158Z" fill="white"/>
<path d="M100.266 7.86095C99.9046 7.66226 99.4579 7.56225 98.9245 7.56225H97.7083V12.9763H98.8831C99.4325 12.9763 99.8913 12.8749 100.258 12.6736C100.625 12.4722 100.901 12.1709 101.086 11.7695C101.271 11.3681 101.363 10.8653 101.363 10.2613C101.363 9.65719 101.271 9.15712 101.086 8.75707C100.902 8.35835 100.629 8.05831 100.269 7.85962L100.266 7.86095Z" fill="white"/>
<path d="M113.065 9.58775C112.855 9.41306 112.593 9.32505 112.279 9.32505C111.966 9.32505 111.693 9.41306 111.48 9.58775C111.268 9.76244 111.111 9.9958 111.007 10.2905C110.903 10.5852 110.851 10.9119 110.851 11.2746C110.851 11.6374 110.903 11.9601 111.007 12.2521C111.111 12.5441 111.27 12.7775 111.48 12.9509C111.693 13.1242 111.958 13.2109 112.279 13.2109C112.601 13.2109 112.854 13.1242 113.065 12.9509C113.275 12.7775 113.433 12.5441 113.537 12.2521C113.641 11.9601 113.691 11.6334 113.691 11.2746C113.691 10.9159 113.641 10.5852 113.537 10.2905C113.433 9.99714 113.275 9.76244 113.065 9.58775Z" fill="white"/>
<path d="M118.25 4.67654H95.4799C95.1118 4.67654 94.8131 4.97525 94.8131 5.34329V15.3099C94.8131 15.678 95.1118 15.9767 95.4799 15.9767H118.25C118.618 15.9767 118.916 15.678 118.916 15.3099V5.34329C118.916 4.97525 118.618 4.67654 118.25 4.67654ZM102.322 12.3789C102.018 12.9696 101.581 13.4217 101.009 13.7377C100.438 14.0538 99.7511 14.2111 98.951 14.2111H96.2786V6.32609H99.0057C99.7884 6.32609 100.462 6.48344 101.026 6.79815C101.589 7.11286 102.022 7.56358 102.325 8.15166C102.629 8.73974 102.779 9.4425 102.779 10.2613C102.779 11.08 102.627 11.7881 102.323 12.3789H102.322ZM108.748 14.2111H107.397V13.1603H107.336C107.203 13.491 106.984 13.7631 106.68 13.9724C106.376 14.1831 106.001 14.2885 105.557 14.2885C105.17 14.2885 104.828 14.2018 104.53 14.0284C104.234 13.8551 104.002 13.603 103.836 13.2697C103.669 12.9376 103.586 12.5349 103.586 12.0628V8.29701H104.98V11.8468C104.98 12.2215 105.082 12.5202 105.288 12.7403C105.493 12.9616 105.764 13.071 106.097 13.071C106.303 13.071 106.501 13.0203 106.693 12.9203C106.885 12.8203 107.044 12.6709 107.169 12.4722C107.293 12.2735 107.356 12.0242 107.356 11.7228V8.29568H108.75V14.2098L108.748 14.2111ZM114.758 12.8789C114.526 13.3363 114.198 13.6911 113.774 13.9458C113.35 14.2005 112.85 14.3271 112.273 14.3271C111.695 14.3271 111.194 14.2005 110.771 13.9458C110.347 13.6911 110.02 13.3363 109.788 12.8789C109.555 12.4229 109.44 11.8882 109.44 11.2774C109.44 10.6667 109.556 10.1306 109.788 9.67186C110.02 9.2118 110.348 8.85575 110.771 8.60105C111.195 8.34635 111.695 8.21967 112.273 8.21967C112.85 8.21967 113.352 8.34635 113.774 8.60105C114.198 8.85575 114.526 9.2118 114.758 9.67186C114.99 10.1306 115.106 10.6667 115.106 11.2774C115.106 11.8882 114.99 12.4229 114.758 12.8789ZM117.603 7.89029L116.727 8.05565C116.444 8.11032 116.22 8.33835 116.168 8.63306L116.008 9.53851C115.981 9.69853 115.76 9.69853 115.732 9.53851L115.572 8.63306C115.52 8.34102 115.298 8.10899 115.013 8.05565L114.137 7.89029C113.982 7.86362 113.982 7.63426 114.137 7.60492L115.013 7.43957C115.296 7.38489 115.52 7.15686 115.572 6.86216L115.732 5.95671C115.759 5.79669 115.98 5.79669 116.008 5.95671L116.168 6.86216C116.22 7.1542 116.441 7.38623 116.727 7.43957L117.603 7.60492C117.757 7.63159 117.757 7.86096 117.603 7.89029Z" fill="white"/>
<path d="M177.658 4.96689L169.697 0.372693C168.825 -0.124231 167.747 -0.124231 166.885 0.372693L158.924 4.96689C158.053 5.47319 157.518 6.40141 157.518 7.40463V16.593C157.518 17.5963 158.053 18.5245 158.924 19.0308L166.885 23.625C167.316 23.8781 167.803 24 168.291 24C168.779 24 169.266 23.8781 169.697 23.625L177.658 19.0308C178.53 18.5338 179.064 17.5963 179.064 16.593V7.40463C179.064 6.40141 178.53 5.47319 177.658 4.96689ZM168.76 22.0029C168.469 22.1717 168.113 22.1717 167.822 22.0029L159.862 17.4087C159.571 17.24 159.393 16.9306 159.393 16.593V7.40463C159.393 7.0671 159.571 6.75769 159.862 6.58893L167.822 1.99473C167.963 1.91034 168.132 1.87284 168.291 1.87284C168.45 1.87284 168.619 1.91034 168.76 1.99473L176.72 6.58893C177.011 6.75769 177.189 7.0671 177.189 7.40463V16.0492L170.316 12.0832V11.1456C170.316 10.9487 170.213 10.7612 170.035 10.6581L168.572 9.81424C168.394 9.7111 168.188 9.7111 168.01 9.81424L166.547 10.6581C166.369 10.7612 166.266 10.9487 166.266 11.1456V12.8333C166.266 13.0302 166.369 13.2177 166.547 13.3208L168.01 14.1647C168.188 14.2678 168.394 14.2678 168.572 14.1647L169.379 13.6959L176.242 17.6619L168.76 21.9842V22.0029Z" fill="white"/>
<path d="M188.543 18.0837C188.346 18.0837 188.252 18.0086 188.252 17.8586C188.252 17.7086 188.262 17.7367 188.29 17.6711C188.309 17.6055 188.337 17.5305 188.355 17.4648L192.368 6.65441C192.425 6.48564 192.49 6.36376 192.556 6.29812C192.622 6.23249 192.753 6.19499 192.95 6.19499H194.009C194.206 6.19499 194.337 6.23249 194.403 6.29812C194.469 6.36376 194.534 6.48564 194.59 6.65441L198.603 17.4648C198.622 17.5305 198.65 17.6055 198.669 17.6711C198.688 17.7367 198.707 17.8024 198.707 17.8586C198.707 18.0086 198.613 18.0837 198.416 18.0837H197.441C197.244 18.0837 197.113 18.0461 197.047 17.9805C196.981 17.9149 196.916 17.793 196.859 17.6242L195.912 14.9333H190.99L190.081 17.6242C190.024 17.793 189.959 17.9149 189.893 17.9805C189.828 18.0461 189.696 18.0837 189.499 18.0837H188.543ZM191.459 13.602H195.472L193.447 7.77014L191.459 13.602Z" fill="white"/>
<path d="M201.266 18.0837H200.254C200.028 18.0837 199.907 17.9712 199.907 17.7368V9.72037C199.907 9.49534 200.019 9.37346 200.254 9.37346H201.013C201.238 9.37346 201.369 9.48597 201.407 9.70161L201.51 10.2548C202.063 9.87976 202.597 9.59848 203.123 9.41096C203.648 9.21407 204.182 9.12031 204.716 9.12031C205.776 9.12031 206.498 9.52347 206.882 10.3392C208.017 9.52347 209.151 9.12031 210.276 9.12031C211.401 9.12031 211.673 9.34533 212.095 9.786C212.517 10.236 212.733 10.8642 212.733 11.6893V17.7274C212.733 17.9524 212.62 18.0743 212.386 18.0743H211.373C211.148 18.0743 211.026 17.9618 211.026 17.7274V12.1675C211.026 11.5862 210.914 11.1643 210.698 10.9017C210.483 10.6298 210.136 10.4892 209.667 10.4892C208.832 10.4892 207.989 10.7423 207.145 11.258C207.154 11.3424 207.164 11.4268 207.164 11.5112V17.7274C207.164 17.9524 207.051 18.0743 206.817 18.0743H205.804C205.579 18.0743 205.457 17.9618 205.457 17.7274V12.1675C205.457 11.5862 205.345 11.1643 205.129 10.9017C204.913 10.6298 204.566 10.4892 204.098 10.4892C203.226 10.4892 202.391 10.7423 201.594 11.2486V17.7368C201.594 17.9618 201.482 18.0837 201.247 18.0837H201.266Z" fill="white"/>
<path d="M217.018 18.3087C216.202 18.3087 215.555 18.0743 215.058 17.6055C214.58 17.1367 214.336 16.5179 214.336 15.7491C214.336 14.9803 214.636 14.249 215.227 13.7614C215.818 13.2551 216.624 13.002 217.627 13.002C218.63 13.002 218.987 13.0957 219.793 13.2926V12.1581C219.793 11.5393 219.652 11.108 219.362 10.8549C219.09 10.6017 218.612 10.4798 217.937 10.4798C217.261 10.4798 217.177 10.508 216.774 10.5642C216.371 10.6205 215.986 10.7049 215.621 10.8174C215.452 10.8642 215.33 10.9018 215.264 10.9205C215.208 10.9299 215.161 10.9393 215.124 10.9393C214.983 10.9393 214.917 10.8361 214.917 10.6299V10.1704C214.917 10.011 214.936 9.89853 214.983 9.84227C215.03 9.77664 215.124 9.71101 215.255 9.65475C215.621 9.49536 216.071 9.3641 216.614 9.27972C217.168 9.17658 217.702 9.1297 218.227 9.1297C219.315 9.1297 220.112 9.35473 220.627 9.79539C221.143 10.2454 221.396 10.9299 221.396 11.8675V17.7368C221.396 17.9618 221.284 18.0837 221.049 18.0837H220.309C220.093 18.0837 219.962 17.9712 219.934 17.7555L219.849 17.193C219.437 17.5493 218.977 17.8212 218.48 18.0181C217.993 18.215 217.496 18.3087 217.008 18.3087H217.018ZM217.43 17.0148C218.227 17.0148 219.024 16.7242 219.802 16.1429V14.3896C219.521 14.324 219.212 14.2677 218.893 14.2396C218.583 14.1927 218.283 14.1739 217.983 14.1739C216.69 14.1739 216.043 14.6709 216.043 15.6647C216.043 16.6586 216.164 16.4242 216.399 16.6586C216.643 16.9023 216.98 17.0148 217.43 17.0148Z" fill="white"/>
<path d="M229.525 18.0837H223.281C223.056 18.0837 222.934 17.9711 222.934 17.7368V17.1554C222.934 16.9679 222.953 16.8367 222.981 16.7617C223.028 16.6773 223.103 16.5741 223.225 16.4335L227.922 10.7236H223.44C223.215 10.7236 223.093 10.6111 223.093 10.3767V9.72034C223.093 9.49532 223.206 9.37343 223.44 9.37343H229.46C229.685 9.37343 229.806 9.48594 229.806 9.72034V10.2829C229.806 10.4423 229.788 10.5736 229.76 10.6579C229.722 10.7423 229.647 10.8455 229.535 10.9861L224.743 16.7335H229.516C229.741 16.7335 229.863 16.846 229.863 17.0617V17.7274C229.863 17.9524 229.75 18.0743 229.516 18.0743L229.525 18.0837Z" fill="white"/>
<path d="M234.944 18.3369C233.66 18.3369 232.647 17.9337 231.907 17.1367C231.166 16.321 230.791 15.1865 230.791 13.7239C230.791 12.2613 231.166 11.1268 231.907 10.3298C232.647 9.53287 233.66 9.1297 234.944 9.1297C236.229 9.1297 237.251 9.53287 237.982 10.3298C238.723 11.1268 239.098 12.2613 239.098 13.7239C239.098 15.1865 238.723 16.3304 237.982 17.1367C237.251 17.9337 236.238 18.3369 234.944 18.3369ZM234.944 16.968C235.732 16.968 236.332 16.7054 236.745 16.1804C237.157 15.6553 237.363 14.8396 237.363 13.7239C237.363 12.6082 237.157 11.8112 236.745 11.2862C236.332 10.7611 235.732 10.4986 234.944 10.4986C234.157 10.4986 233.557 10.7611 233.144 11.2862C232.732 11.8112 232.525 12.6269 232.525 13.7239C232.525 14.8209 232.732 15.6553 233.144 16.1804C233.557 16.7054 234.157 16.968 234.944 16.968Z" fill="white"/>
<path d="M242.211 18.0837H241.198C240.973 18.0837 240.851 17.9712 240.851 17.7368V9.72037C240.851 9.49534 240.964 9.37346 241.198 9.37346H241.958C242.183 9.37346 242.314 9.48597 242.351 9.70161L242.455 10.3392C243.542 9.52347 244.686 9.12031 245.886 9.12031C247.086 9.12031 247.358 9.34533 247.789 9.786C248.221 10.2173 248.446 10.8549 248.446 11.6893V17.7274C248.446 17.9524 248.333 18.0743 248.099 18.0743H247.086C246.861 18.0743 246.739 17.9618 246.739 17.7274V12.2519C246.739 11.6424 246.617 11.2018 246.364 10.9111C246.12 10.6205 245.736 10.4798 245.211 10.4798C244.686 10.4798 244.302 10.5548 243.852 10.7048C243.401 10.8549 242.97 11.0705 242.548 11.3612V17.7274C242.548 17.9524 242.436 18.0743 242.201 18.0743L242.211 18.0837Z" fill="white"/>
<path d="M265.369 20.8308C265.313 20.8308 265.229 20.8214 265.107 20.7933C265.004 20.7839 264.816 20.7464 264.544 20.6901C263.71 20.5026 262.903 20.212 262.125 19.7994C261.347 19.3963 260.616 18.9181 259.931 18.3555C258.825 18.318 257.868 18.0555 257.062 17.5492C256.265 17.0429 255.646 16.3397 255.206 15.4209C254.784 14.502 254.568 13.4144 254.568 12.1393C254.568 10.8642 254.793 9.72032 255.234 8.7921C255.684 7.86389 256.321 7.16069 257.156 6.66377C257.99 6.17622 258.984 5.92307 260.137 5.92307C261.291 5.92307 262.285 6.16685 263.11 6.66377C263.944 7.15132 264.582 7.86389 265.032 8.7921C265.482 9.72032 265.697 10.8361 265.697 12.1393C265.697 13.4426 265.341 15.1208 264.638 16.1709C263.925 17.2117 262.941 17.8774 261.685 18.1774C262.163 18.4493 262.688 18.6837 263.25 18.8806C263.813 19.0775 264.46 19.1994 265.191 19.2556C265.379 19.265 265.491 19.3025 265.538 19.3588C265.585 19.4244 265.604 19.565 265.604 19.7713V20.5776C265.604 20.737 265.519 20.8214 265.36 20.8214L265.369 20.8308ZM260.156 16.9023C261.375 16.9023 262.313 16.4991 262.95 15.7022C263.588 14.8864 263.907 13.7051 263.907 12.1487C263.907 10.5923 263.588 9.41091 262.95 8.61396C262.313 7.81701 261.375 7.41384 260.156 7.41384C258.937 7.41384 257.99 7.81701 257.343 8.61396C256.706 9.41091 256.387 10.5923 256.387 12.1487C256.387 13.7051 256.706 14.8864 257.343 15.7022C258 16.4991 258.937 16.9023 260.156 16.9023Z" fill="white"/>
</svg>
