<svg width="206" height="43" viewBox="0 0 206 43" fill="none" xmlns="http://www.w3.org/2000/svg">
<g id="Right - New">
<path id="Rectangle 19844" d="M133 21C133 18.7909 131.209 17 129 17L39 17C36.7909 17 35 18.7909 35 21V21C35 23.2091 36.7909 25 39 25L129 25C131.209 25 133 23.2091 133 21V21Z" stroke="url(#paint0_linear_745_3492)" stroke-width="0.918551"/>
<path id="Rectangle 19841" d="M20 7C20 4.79086 21.7909 3 24 3L105 3C107.209 3 109 4.79086 109 7C109 9.20914 107.209 11 105 11L24 11C21.7909 11 20 9.20914 20 7Z" fill="url(#paint1_linear_745_3492)" stroke="url(#paint2_linear_745_3492)" stroke-width="0.918551"/>
<path id="Rectangle 19842" d="M20 35C20 32.7909 21.7909 31 24 31L92 31C94.2091 31 96 32.7909 96 35C96 37.2091 94.2091 39 92 39L24 39C21.7909 39 20 37.2091 20 35Z" fill="url(#paint3_linear_745_3492)" stroke="url(#paint4_linear_745_3492)" stroke-width="0.918551"/>
<path id="Vector" d="M27.5488 5.39839L27.6504 5.4742L27.7758 5.4925L35.6679 6.64463L36.8185 14.5546L36.8367 14.6799L36.9123 14.7814L41.6854 21.1861L36.9123 27.5908L36.8367 27.6923L36.8185 27.8176L35.668 35.7221L27.7758 36.8743L27.6502 36.8926L27.5486 36.9685L21.1545 41.748L14.7603 36.9685L14.6587 36.8926L14.5332 36.8743L6.63556 35.7221L5.48507 27.8176L5.46686 27.6925L5.39136 27.591L0.623333 21.1861L5.39136 14.7812L5.46688 14.6797L5.48508 14.5546L6.63559 6.64466L14.5332 5.49251L14.6586 5.47421L14.7601 5.39839L21.1545 0.623999L27.5488 5.39839Z" fill="#2F2A6B" stroke="#A989F5"/>
<path id="Vector_2" d="M21.1364 5.07397L26.2197 8.87057L32.4934 9.7867L33.4079 16.0758L37.2018 21.1682L33.4079 26.2606L32.4934 32.5456L26.2197 33.4618L21.1364 37.2625L16.0532 33.4618L9.77531 32.5456L8.86082 26.2606L5.07104 21.1682L8.86082 16.0758L9.77531 9.7867L16.0532 8.87057L21.1364 5.07397Z" fill="#A989F5"/>
<path id="Vector_3" d="M28.9245 19.8278L26.7178 14.0583C26.7178 14.0583 26.6101 13.8446 26.5025 13.7912C26.3948 13.7377 26.2872 13.6843 26.1795 13.6843C26.0719 13.6843 25.9642 13.6843 25.8566 13.7912C25.7489 13.8446 25.6951 13.9514 25.6413 14.1117L24.1343 18.6525H18.1061L16.599 14.1117C16.599 14.1117 16.4914 13.898 16.3838 13.7912C16.2761 13.7377 16.1685 13.6843 16.0608 13.6843C15.9532 13.6843 15.7917 13.6843 15.7379 13.7912C15.6302 13.8446 15.5764 13.9514 15.5226 14.0583L13.3158 19.7744C12.67 21.5373 13.2082 23.4605 14.6614 24.5289L17.9984 27.0397L19.667 28.2684L20.6896 29.0163C20.6896 29.0163 21.2816 29.1766 21.4969 29.0163L22.5196 28.2684L24.1881 27.0397L27.5789 24.5289C29.0321 23.4071 29.5704 21.5373 28.9245 19.8278Z" fill="white"/>
<path id="Rectangle 19845" d="M122 35C122 32.7909 120.209 31 118 31L106 31C103.791 31 102 32.7909 102 35V35C102 37.2091 103.791 39 106 39L118 39C120.209 39 122 37.2091 122 35V35Z" stroke="url(#paint5_linear_745_3492)" stroke-width="0.918551"/>
<path id="Vector_4" d="M182.776 37.393L183.646 32.6614C183.957 31.105 185.075 29.8599 186.627 29.6732L191.348 28.8016C192.217 28.6148 192.217 27.4319 191.348 27.2451L186.627 26.3735C185.075 26.0622 183.894 24.9417 183.646 23.3853L182.776 18.6537C182.59 17.7821 181.41 17.7821 181.224 18.6537L180.354 23.3853C180.044 24.9417 178.925 26.1868 177.373 26.3735L172.652 27.2451C171.783 27.4319 171.783 28.6148 172.652 28.8016L177.373 29.6732C178.925 29.9844 180.168 31.105 180.354 32.6614L181.224 37.393C181.472 38.2023 182.59 38.2023 182.776 37.393Z" fill="url(#paint6_linear_745_3492)"/>
<path id="Vector_5" d="M201.388 14.6965L201.823 12.3307C201.978 11.5525 202.537 10.93 203.314 10.8366L205.674 10.4008C206.109 10.3074 206.109 9.71595 205.674 9.62257L203.314 9.18677C202.537 9.03112 201.947 8.47084 201.823 7.69263L201.388 5.32685C201.295 4.89105 200.705 4.89105 200.612 5.32685L200.177 7.69263C200.022 8.47084 199.463 9.09338 198.686 9.18677L196.326 9.62257C195.891 9.71595 195.891 10.3074 196.326 10.4008L198.686 10.8366C199.463 10.9922 200.084 11.5525 200.177 12.3307L200.612 14.6965C200.736 15.1012 201.295 15.1012 201.388 14.6965Z" fill="url(#paint7_linear_745_3492)"/>
</g>
<defs>
<linearGradient id="paint0_linear_745_3492" x1="-15.8767" y1="6.22936" x2="-12.7196" y2="-6.23185" gradientUnits="userSpaceOnUse">
<stop stop-color="#CEB3EF"/>
<stop offset="0.843243" stop-color="#FC6D26"/>
</linearGradient>
<linearGradient id="paint1_linear_745_3492" x1="115.561" y1="6.92363" x2="18.7943" y2="6.92367" gradientUnits="userSpaceOnUse">
<stop offset="0.195" stop-color="#271D50" stop-opacity="0.05"/>
<stop offset="0.77" stop-color="#FCA326" stop-opacity="0.36"/>
</linearGradient>
<linearGradient id="paint2_linear_745_3492" x1="-8.26752" y1="8.54425" x2="12.3278" y2="41.3469" gradientUnits="userSpaceOnUse">
<stop stop-color="#FCA326"/>
<stop offset="1" stop-color="#A989F5"/>
</linearGradient>
<linearGradient id="paint3_linear_745_3492" x1="101.602" y1="34.9236" x2="18.9704" y2="34.9237" gradientUnits="userSpaceOnUse">
<stop offset="0.195" stop-color="#271D50" stop-opacity="0.05"/>
<stop offset="0.77" stop-color="#FCA326" stop-opacity="0.36"/>
</linearGradient>
<linearGradient id="paint4_linear_745_3492" x1="-4.13855" y1="36.5443" x2="17.6878" y2="66.2299" gradientUnits="userSpaceOnUse">
<stop stop-color="#FCA326"/>
<stop offset="1" stop-color="#A989F5"/>
</linearGradient>
<linearGradient id="paint5_linear_745_3492" x1="91.617" y1="20.2294" x2="98.0954" y2="15.0109" gradientUnits="userSpaceOnUse">
<stop stop-color="#CEB3EF"/>
<stop offset="0.843243" stop-color="#FC6D26"/>
</linearGradient>
<linearGradient id="paint6_linear_745_3492" x1="191.983" y1="27.9716" x2="171.925" y2="27.9716" gradientUnits="userSpaceOnUse">
<stop offset="0.2" stop-color="#F49B26"/>
<stop offset="0.7" stop-color="#F46D26"/>
</linearGradient>
<linearGradient id="paint7_linear_745_3492" x1="205.992" y1="9.98582" x2="195.963" y2="9.98582" gradientUnits="userSpaceOnUse">
<stop offset="0.2" stop-color="#F49B26"/>
<stop offset="0.7" stop-color="#F46D26"/>
</linearGradient>
</defs>
</svg>
