<svg width="375" height="1040" viewBox="0 0 375 1040" fill="none" xmlns="http://www.w3.org/2000/svg">
<g clip-path="url(#clip0_150_1419)">
<path d="M450 -15.0144H-206V1040H450V-15.0144Z" fill="#232150"/>
<path d="M450 -15.0144H-206V1040H450V-15.0144Z" fill="url(#paint0_radial_150_1419)" fill-opacity="0.15"/>
<path d="M450 -15.0144H-206V1040H450V-15.0144Z" fill="url(#paint1_radial_150_1419)" fill-opacity="0.2"/>
<path fill-rule="evenodd" clip-rule="evenodd" d="M275.243 154.336H321.918C323.713 154.336 325.135 152.838 325.135 151.041C325.135 149.245 323.713 147.822 321.918 147.822H275.243V154.336ZM270.98 179.643H300.75C302.545 179.643 304.041 178.221 303.966 176.349C303.966 174.552 302.545 173.129 300.75 173.129H270.98V179.643ZM321.918 179.643H314.887C313.092 179.643 311.671 178.22 311.671 176.423C311.671 174.626 313.092 173.204 314.887 173.204H321.918C323.714 173.204 325.135 174.626 325.135 176.423C325.135 178.22 323.714 179.643 321.918 179.643ZM251.906 204.949H277.338C279.133 204.949 280.629 203.526 280.554 201.654C280.554 199.858 279.133 198.435 277.338 198.435H254.898L251.906 204.949ZM321.918 204.948H291.624C289.829 204.948 288.408 203.526 288.408 201.729C288.408 199.932 289.829 198.509 291.624 198.509H321.918C323.714 198.509 325.135 199.932 325.135 201.729C325.135 203.526 323.714 204.948 321.918 204.948ZM225.651 255.638H280.031C281.826 255.638 283.322 254.215 283.247 252.343C283.247 250.546 281.826 249.124 280.031 249.124H225.651V255.638ZM321.918 255.637H294.317C292.522 255.637 291.101 254.215 291.101 252.418C291.101 250.621 292.522 249.198 294.317 249.198H321.918C323.714 249.198 325.135 250.621 325.135 252.418C325.135 254.215 323.714 255.637 321.918 255.637ZM210.317 306.325H261.705C263.5 306.325 264.921 304.828 264.921 303.031C264.921 301.234 263.5 299.811 261.705 299.811H210.317V306.325ZM259.012 331.632H207.625V325.118H259.012C260.807 325.118 262.228 326.541 262.228 328.338C262.228 330.21 260.807 331.632 259.012 331.632ZM275.917 306.325H294.542C296.337 306.325 297.833 304.827 297.758 303.105C297.758 301.308 296.337 299.886 294.542 299.886H275.917C274.121 299.886 272.7 301.308 272.7 303.105C272.7 304.902 274.121 306.325 275.917 306.325ZM234.852 280.943H216.974V274.43H234.852C236.647 274.43 238.068 275.852 238.068 277.649C238.068 279.521 236.647 280.943 234.852 280.943ZM272.102 230.33H302.321C304.116 230.33 305.537 228.833 305.537 227.111C305.537 225.314 304.116 223.891 302.321 223.891H272.102C270.306 223.891 268.885 225.314 268.885 227.111C268.885 228.908 270.306 230.33 272.102 230.33ZM257.815 230.33H238.816V223.817H257.815C259.61 223.817 261.031 225.239 261.031 227.036C261.031 228.833 259.61 230.33 257.815 230.33ZM316.533 230.33H321.918C323.713 230.33 325.135 228.833 325.135 227.111C325.135 225.314 323.713 223.891 321.918 223.891H316.533C314.737 223.891 313.316 225.314 313.316 227.111C313.316 228.908 314.737 230.33 316.533 230.33ZM302.321 280.943H249.138C247.343 280.943 245.922 279.521 245.922 277.724C245.922 275.927 247.343 274.504 249.138 274.504H302.321C304.116 274.504 305.537 275.927 305.537 277.724C305.537 279.521 304.116 280.943 302.321 280.943ZM273.373 331.632H282.499C284.294 331.632 285.715 330.209 285.715 328.412C285.715 326.616 284.294 325.193 282.499 325.193H273.373C271.578 325.193 270.157 326.616 270.157 328.412C270.157 330.209 271.578 331.632 273.373 331.632Z" fill="url(#paint2_linear_150_1419)"/>
<path d="M63.0812 174.343V181.974L95.8911 162.374V331.444H102.543V158.409L109.344 154.369H131.541V331.444H138.193V147.861H107.401L63.0812 174.343Z" fill="white"/>
<path d="M152.991 147.861V154.369H239.238C236.473 166.937 234.231 173.745 224.44 187.211C198.058 223.419 182.96 261.422 175.561 310.497C174.814 315.509 173.618 326.282 173.02 331.519H179.747C180.345 326.057 181.466 316.108 182.213 311.47C189.463 263.442 204.186 226.261 229.97 190.951C240.807 176.064 243.199 168.433 246.189 154.369H273.617C272.945 166.264 268.759 177.56 261.36 187.136C249.477 202.622 240.359 216.835 233.483 230.6L230.12 237.333C217.863 261.796 210.09 287.905 206.877 314.986L204.933 331.593H211.66L213.528 315.734C216.592 289.401 224.216 264.04 236.099 240.176L239.462 233.443C246.189 220.052 255.082 206.212 266.742 191.101C275.635 179.505 280.418 165.74 280.418 151.227V148.01H152.991V147.861Z" fill="white"/>
<path d="M159.532 133.877C158.249 133.877 157.127 133.641 156.166 133.17C155.223 132.679 154.488 131.982 153.96 131.077C153.45 130.153 153.196 129.078 153.196 127.852V118.688C153.196 117.443 153.45 116.369 153.96 115.463C154.488 114.558 155.223 113.87 156.166 113.399C157.127 112.908 158.249 112.663 159.532 112.663C160.814 112.663 161.926 112.908 162.869 113.399C163.812 113.889 164.538 114.587 165.047 115.492C165.575 116.378 165.839 117.443 165.839 118.688H162.784C162.784 117.613 162.502 116.793 161.936 116.227C161.37 115.661 160.569 115.379 159.532 115.379C158.495 115.379 157.684 115.661 157.099 116.227C156.534 116.793 156.251 117.604 156.251 118.66V127.852C156.251 128.908 156.534 129.728 157.099 130.313C157.684 130.898 158.495 131.19 159.532 131.19C160.569 131.19 161.37 130.898 161.936 130.313C162.502 129.728 162.784 128.908 162.784 127.852V125.533H158.938V122.846H165.839V127.852C165.839 129.078 165.575 130.143 165.047 131.048C164.538 131.953 163.812 132.651 162.869 133.141C161.926 133.632 160.814 133.877 159.532 133.877ZM169.76 133.594V130.822H175.219V120.809H170.467V118.037H178.189V130.822H183.195V133.594H169.76ZM176.407 115.35C175.747 115.35 175.219 115.181 174.823 114.841C174.427 114.483 174.229 114.011 174.229 113.427C174.229 112.823 174.427 112.352 174.823 112.013C175.219 111.654 175.747 111.475 176.407 111.475C177.067 111.475 177.595 111.654 177.991 112.013C178.387 112.352 178.585 112.823 178.585 113.427C178.585 114.011 178.387 114.483 177.991 114.841C177.595 115.181 177.067 115.35 176.407 115.35ZM194.187 133.594C192.773 133.594 191.669 133.207 190.877 132.434C190.086 131.661 189.69 130.586 189.69 129.21V120.809H185.39V118.037H189.69V113.653H192.744V118.037H198.826V120.809H192.744V129.21C192.744 130.285 193.263 130.822 194.3 130.822H198.543V133.594H194.187ZM203.623 133.594V112.946H206.678V130.794H215.701V133.594H203.623ZM224.005 133.877C222.384 133.877 221.101 133.462 220.158 132.632C219.235 131.784 218.773 130.634 218.773 129.182C218.773 127.711 219.263 126.56 220.243 125.731C221.243 124.882 222.61 124.458 224.345 124.458H228.672V123.015C228.672 122.167 228.408 121.507 227.88 121.036C227.352 120.564 226.607 120.328 225.646 120.328C224.797 120.328 224.09 120.517 223.524 120.894C222.959 121.252 222.629 121.733 222.534 122.337H219.536C219.706 120.941 220.347 119.829 221.46 118.999C222.591 118.169 224.015 117.754 225.731 117.754C227.579 117.754 229.04 118.226 230.115 119.169C231.19 120.093 231.727 121.356 231.727 122.959V133.594H228.757V130.737H228.248L228.757 130.172C228.757 131.303 228.323 132.208 227.456 132.887C226.589 133.547 225.438 133.877 224.005 133.877ZM224.91 131.529C226.004 131.529 226.9 131.256 227.597 130.709C228.314 130.143 228.672 129.427 228.672 128.559V126.523H224.401C223.609 126.523 222.978 126.74 222.506 127.173C222.054 127.607 221.827 128.201 221.827 128.955C221.827 129.747 222.101 130.379 222.648 130.85C223.194 131.303 223.949 131.529 224.91 131.529ZM243.2 133.877C241.917 133.877 240.899 133.528 240.145 132.83C239.391 132.114 239.013 131.143 239.013 129.917L239.664 130.624H239.013V133.594H235.987V112.946H239.042V117.387L238.957 121.007H239.664L239.013 121.714C239.013 120.489 239.391 119.527 240.145 118.829C240.918 118.113 241.936 117.754 243.2 117.754C244.765 117.754 246.019 118.282 246.961 119.338C247.904 120.394 248.376 121.828 248.376 123.638V128.022C248.376 129.813 247.904 131.237 246.961 132.293C246.019 133.349 244.765 133.877 243.2 133.877ZM242.153 131.218C243.152 131.218 243.935 130.935 244.501 130.37C245.066 129.785 245.349 128.946 245.349 127.852V123.779C245.349 122.685 245.066 121.856 244.501 121.29C243.935 120.706 243.152 120.413 242.153 120.413C241.191 120.413 240.428 120.715 239.862 121.318C239.315 121.903 239.042 122.723 239.042 123.779V127.852C239.042 128.908 239.315 129.738 239.862 130.341C240.428 130.926 241.191 131.218 242.153 131.218Z" fill="white"/>
<path d="M360.48 79.4166H230.966C212.49 79.4166 197.455 63.189 197.455 42.9725C197.455 22.8467 212.49 6.52856 230.966 6.52856H360.48C378.956 6.52856 393.991 22.7561 393.991 42.9725C393.991 63.0983 378.956 79.4166 360.48 79.4166Z" stroke="url(#paint3_linear_150_1419)" stroke-width="1.36008"/>
<path d="M243.736 30.9151H114.221C95.7452 30.9151 80.7107 14.6875 80.7107 -5.52893C80.7107 -25.6547 95.7452 -41.9729 114.221 -41.9729H243.736C262.212 -41.9729 277.247 -25.7454 277.247 -5.52893C277.247 14.5969 262.212 30.9151 243.736 30.9151Z" stroke="url(#paint4_linear_150_1419)" stroke-width="1.36008"/>
<path d="M347.257 42.8819L319.633 70.6229V15.1409L347.257 42.8819Z" fill="#F46D26"/>
<path d="M308.855 42.8819L281.232 70.6229V15.1409L308.855 42.8819Z" fill="#F49B26"/>
<path d="M270.454 42.8819L242.83 70.6229V15.1409L270.454 42.8819Z" fill="#F7D1A3"/>
<path d="M96.0252 447.785H-33.4893C-51.9655 447.785 -67 431.557 -67 411.341C-67 391.215 -51.9655 374.897 -33.4893 374.897H96.0252C114.501 374.897 129.536 391.125 129.536 411.341C129.536 431.557 114.501 447.785 96.0252 447.785Z" stroke="#E24329" stroke-width="1.36008"/>
<path d="M56.1265 71.7857L56.0359 71.6951L51.0546 58.7311C50.9641 58.4591 50.7829 58.2779 50.5112 58.0966C50.33 58.0059 50.1489 57.9153 49.9678 57.9153C49.7866 57.9153 49.5149 57.9153 49.3338 58.0059C49.1526 58.0966 48.9715 58.1873 48.7904 58.3686C48.6092 58.5499 48.5187 58.7312 48.5187 58.9125L45.1676 69.2474H31.4916L28.1405 58.9125C28.05 58.7312 27.9593 58.5499 27.8688 58.3686C27.7782 58.1873 27.5971 58.0966 27.3254 58.0059C27.1442 57.9153 26.9631 57.9153 26.6914 57.9153C26.5102 57.9153 26.3291 58.0059 26.148 58.0966C25.8763 58.2779 25.6951 58.4591 25.6045 58.7311L20.6232 71.6951L20.5327 71.7857C19.8081 73.6895 19.7175 75.6839 20.261 77.6784C20.8044 79.5822 21.9818 81.3047 23.6121 82.4832L31.2199 88.1945L35.0238 91.005L37.288 92.7274C37.5597 92.9087 37.922 92.9994 38.1937 92.9994C38.4654 92.9994 38.8277 92.9087 39.0994 92.7274L41.3637 91.005L45.1676 88.1945L52.866 82.4832C54.4963 81.3047 55.6737 79.5822 56.2171 77.6784C56.9417 75.7746 56.8511 73.6895 56.1265 71.7857Z" fill="url(#paint5_linear_150_1419)"/>
<path opacity="0.15" d="M38.3749 115.028C60.1837 115.028 77.8632 97.3315 77.8632 75.5017C77.8632 53.6719 60.1837 35.9753 38.3749 35.9753C16.5661 35.9753 -1.11349 53.6719 -1.11349 75.5017C-1.11349 97.3315 16.5661 115.028 38.3749 115.028Z" stroke="url(#paint6_linear_150_1419)" stroke-width="4.52848"/>
<path d="M365.408 209.156L364.14 216.318C363.687 218.675 361.967 220.579 359.612 220.85L352.457 222.12C351.189 222.392 351.189 224.205 352.457 224.477L359.612 225.746C361.967 226.199 363.687 227.922 364.14 230.279L365.408 237.441C365.68 238.71 367.491 238.71 367.763 237.441L369.031 230.279C369.484 227.922 371.205 226.018 373.56 225.746L380.715 224.477C381.982 224.205 381.982 222.392 380.715 222.12L373.56 220.85C371.205 220.397 369.303 218.675 369.031 216.318L367.763 209.156C367.401 208.068 365.68 208.068 365.408 209.156Z" fill="url(#paint7_linear_150_1419)"/>
<path d="M51.3267 288.107L52.4136 294.271C52.7759 296.266 54.3155 297.897 56.3081 298.169L62.4668 299.257C63.5537 299.529 63.5537 300.98 62.4668 301.252L56.3081 302.34C54.3155 302.702 52.7759 304.243 52.4136 306.238L51.3267 312.403C51.055 313.49 49.606 313.49 49.3343 312.403L48.2474 306.238C47.8851 304.243 46.3455 302.612 44.3529 302.34L38.1942 301.252C37.1073 300.98 37.1073 299.529 38.1942 299.257L44.3529 298.169C46.3455 297.807 47.9757 296.266 48.2474 294.271L49.3343 288.107C49.5154 287.109 51.055 287.109 51.3267 288.107Z" fill="url(#paint8_linear_150_1419)"/>
<path opacity="0.35" d="M309.498 479.53C279.338 479.53 254.794 455.053 254.794 424.774C254.794 394.494 279.248 370.017 309.498 370.017C339.658 370.017 364.202 394.494 364.202 424.774C364.202 455.053 339.658 479.53 309.498 479.53Z" stroke="url(#paint9_linear_150_1419)" stroke-width="6.80033" stroke-miterlimit="10"/>
<path opacity="0.15" d="M309.498 489.776C273.632 489.776 244.56 460.675 244.56 424.775C244.56 388.875 273.632 359.774 309.498 359.774C345.363 359.774 374.436 388.875 374.436 424.775C374.436 460.675 345.363 489.776 309.498 489.776Z" stroke="url(#paint10_linear_150_1419)" stroke-width="13.6007" stroke-miterlimit="10"/>
<path d="M309.498 460.947C289.663 460.947 273.633 444.901 273.633 425.047C273.633 405.193 289.663 389.147 309.498 389.147C329.333 389.147 345.364 405.193 345.364 425.047C345.364 444.81 329.333 460.947 309.498 460.947Z" fill="url(#paint11_linear_150_1419)"/>
<path d="M323.776 421.496H295.916V440.288H323.776V421.496Z" stroke="white" stroke-width="1.35854" stroke-miterlimit="10"/>
<path d="M300.916 418.365V421.496" stroke="white" stroke-width="1.35854" stroke-miterlimit="10"/>
<path d="M318.775 421.496V416.276C318.775 411.471 314.778 407.576 309.846 407.576C308.306 407.576 306.856 407.956 305.588 408.627" stroke="white" stroke-width="1.35854" stroke-miterlimit="10"/>
<path d="M306.26 431.266L308.678 433.717L313.464 428.325" stroke="white" stroke-width="1.35854" stroke-miterlimit="10"/>
<path d="M299.49 407.142L299.086 409.354C298.959 410.077 298.406 410.673 297.684 410.758L295.474 411.162C295.07 411.247 295.07 411.8 295.474 411.885L297.684 412.289C298.406 412.417 298.959 412.97 299.086 413.693L299.49 415.905C299.575 416.309 300.127 416.309 300.212 415.905L300.616 413.693C300.744 412.97 301.296 412.374 302.019 412.289L304.229 411.885C304.632 411.8 304.632 411.247 304.229 411.162L302.019 410.758C301.296 410.63 300.701 410.077 300.616 409.354L300.212 407.142C300.127 406.78 299.596 406.78 299.49 407.142Z" fill="white"/>
<path d="M306.628 413.348L306.432 414.422C306.37 414.773 306.102 415.062 305.751 415.104L304.678 415.3C304.482 415.341 304.482 415.609 304.678 415.651L305.751 415.847C306.102 415.909 306.37 416.177 306.432 416.528L306.628 417.602C306.669 417.798 306.937 417.798 306.979 417.602L307.175 416.528C307.236 416.177 307.505 415.888 307.855 415.847L308.928 415.651C309.124 415.609 309.124 415.341 308.928 415.3L307.855 415.104C307.505 415.042 307.216 414.773 307.175 414.422L306.979 413.348C306.937 413.173 306.679 413.173 306.628 413.348Z" fill="white"/>
</g>
<defs>
<radialGradient id="paint0_radial_150_1419" cx="0" cy="0" r="1" gradientUnits="userSpaceOnUse" gradientTransform="translate(-66.2646 139.585) rotate(-106.407) scale(637.605 226.382)">
<stop offset="0.050548" stop-color="#CEB3EF"/>
<stop offset="1" stop-color="#CEB3EF" stop-opacity="0"/>
</radialGradient>
<radialGradient id="paint1_radial_150_1419" cx="0" cy="0" r="1" gradientUnits="userSpaceOnUse" gradientTransform="translate(1.85711 977.425) rotate(167.912) scale(301.349 618.784)">
<stop stop-color="#E24329"/>
<stop offset="1" stop-color="#E24329" stop-opacity="0.17"/>
</radialGradient>
<linearGradient id="paint2_linear_150_1419" x1="325.135" y1="249.285" x2="230.606" y2="239.745" gradientUnits="userSpaceOnUse">
<stop offset="0.295138" stop-color="#A989F5" stop-opacity="0.3"/>
<stop offset="0.934251" stop-color="#A989F5"/>
</linearGradient>
<linearGradient id="paint3_linear_150_1419" x1="196.804" y1="42.9668" x2="394.694" y2="42.9668" gradientUnits="userSpaceOnUse">
<stop stop-color="#E24329"/>
<stop offset="1" stop-color="#FCA326"/>
</linearGradient>
<linearGradient id="paint4_linear_150_1419" x1="80.0315" y1="-5.54728" x2="277.92" y2="-5.54728" gradientUnits="userSpaceOnUse">
<stop offset="0.0953621" stop-color="#232150" stop-opacity="0"/>
<stop offset="1" stop-color="#FDF1DD"/>
</linearGradient>
<linearGradient id="paint5_linear_150_1419" x1="58.6242" y1="75.4822" x2="18.5168" y2="75.4822" gradientUnits="userSpaceOnUse">
<stop stop-color="#FCA326"/>
<stop offset="1" stop-color="#A989F5"/>
</linearGradient>
<linearGradient id="paint6_linear_150_1419" x1="47.4892" y1="-143.232" x2="34.8224" y2="159.255" gradientUnits="userSpaceOnUse">
<stop stop-color="#FCA326"/>
<stop offset="1" stop-color="#7759C2"/>
</linearGradient>
<linearGradient id="paint7_linear_150_1419" x1="381.64" y1="223.409" x2="351.393" y2="223.409" gradientUnits="userSpaceOnUse">
<stop offset="0.2" stop-color="#F49B26"/>
<stop offset="0.7" stop-color="#F46D26"/>
</linearGradient>
<linearGradient id="paint8_linear_150_1419" x1="37.2978" y1="300.331" x2="63.3561" y2="300.331" gradientUnits="userSpaceOnUse">
<stop offset="0.2" stop-color="#5943B3"/>
<stop offset="0.7" stop-color="#A181ED"/>
</linearGradient>
<linearGradient id="paint9_linear_150_1419" x1="364.692" y1="424.799" x2="254.329" y2="424.799" gradientUnits="userSpaceOnUse">
<stop offset="0.33" stop-color="#12ACAC" stop-opacity="0.61"/>
<stop offset="0.91" stop-color="#6FD5C4"/>
</linearGradient>
<linearGradient id="paint10_linear_150_1419" x1="374.737" y1="424.8" x2="244.293" y2="424.8" gradientUnits="userSpaceOnUse">
<stop offset="0.33" stop-color="#12ACAC" stop-opacity="0.61"/>
<stop offset="0.91" stop-color="#6FD5C4"/>
</linearGradient>
<linearGradient id="paint11_linear_150_1419" x1="345.352" y1="424.992" x2="273.595" y2="424.992" gradientUnits="userSpaceOnUse">
<stop offset="0.2" stop-color="#6FD2C1"/>
<stop offset="0.7" stop-color="#10A9A9"/>
</linearGradient>
<clipPath id="clip0_150_1419">
<rect width="375" height="1040" fill="white"/>
</clipPath>
</defs>
</svg>
