<svg width="33" height="33" viewBox="0 0 33 33" fill="none" xmlns="http://www.w3.org/2000/svg">
<g clip-path="url(#clip0_1_465)">
<path d="M20.1881 13.905H25.6049V28.1686C25.6049 29.0714 25.2462 29.9373 24.6078 30.5758C23.9694 31.2142 23.1035 31.5729 22.2006 31.5729H13.789C12.8861 31.5729 12.0202 31.2142 11.3818 30.5758C10.7434 29.9373 10.3847 29.0714 10.3847 28.1686V20.4033" stroke="#A989F5" stroke-width="1.27982" stroke-linecap="round" stroke-linejoin="round"/>
<path d="M26.0048 26.3288H26.5679C27.7687 26.3288 28.9202 25.8518 29.7693 25.0028C30.6183 24.1537 31.0953 23.0022 31.0953 21.8014C31.0953 20.6007 30.6183 19.4492 29.7693 18.6001C28.9202 17.7511 27.7687 17.2741 26.5679 17.2741H26.0048" stroke="#A989F5" stroke-width="1.27982" stroke-linecap="round" stroke-linejoin="round"/>
<path d="M17.9974 27.1958L22.2976 24.0859C22.355 24.0437 22.3975 23.9845 22.4194 23.9167C22.4412 23.849 22.4411 23.776 22.4192 23.7083L20.9282 19.1618C20.9166 19.1286 20.8949 19.1 20.8663 19.0797C20.8376 19.0593 20.8034 19.0484 20.7682 19.0484C20.7331 19.0484 20.6989 19.0593 20.6702 19.0797C20.6416 19.1 20.6199 19.1286 20.6083 19.1618L19.626 22.1821H16.3657L15.3834 19.1618C15.3718 19.1286 15.3501 19.1 15.3215 19.0797C15.2928 19.0593 15.2586 19.0484 15.2234 19.0484C15.1883 19.0484 15.1541 19.0593 15.1254 19.0797C15.0968 19.1 15.0751 19.1286 15.0635 19.1618L13.5853 23.7083C13.5634 23.776 13.5633 23.849 13.5851 23.9167C13.6069 23.9845 13.6495 24.0437 13.7069 24.0859L17.9974 27.1958" stroke="#A989F5" stroke-width="1.27982" stroke-linecap="round" stroke-linejoin="round"/>
<path d="M16.3327 4.74784H4.4336C3.95246 4.74784 3.49103 4.93897 3.15081 5.27919C2.81059 5.61941 2.61946 6.08084 2.61946 6.56198V14.4424C2.61946 14.6807 2.66639 14.9166 2.75755 15.1367C2.84872 15.3568 2.98235 15.5568 3.15081 15.7252C3.31927 15.8937 3.51926 16.0273 3.73936 16.1185C3.95946 16.2097 4.19536 16.2566 4.4336 16.2566H9.04733L12.4452 19.1138V16.2566H16.3327C16.8122 16.254 17.2711 16.0618 17.6093 15.7218C17.9474 15.3819 18.1372 14.9219 18.1372 14.4424V6.56198C18.1372 6.0825 17.9474 5.62251 17.6093 5.28257C17.2711 4.94263 16.8122 4.75038 16.3327 4.74784V4.74784Z" stroke="#A989F5" stroke-width="1.27982" stroke-linecap="round" stroke-linejoin="round"/>
<path d="M6.31171 8.78568H14.4577" stroke="#E3D6FF" stroke-width="1.27982" stroke-linecap="round" stroke-linejoin="round"/>
<path d="M19.8289 4.4471H24.0919" stroke="#E3D6FF" stroke-width="1.27982" stroke-linecap="round" stroke-linejoin="round"/>
<path d="M6.31171 11.9308H11.4817" stroke="#E3D6FF" stroke-width="1.27982" stroke-linecap="round" stroke-linejoin="round"/>
<path d="M15.5418 2.67138C15.5418 2.19024 15.733 1.7288 16.0732 1.38859C16.4134 1.04837 16.8748 0.857239 17.356 0.857239H26.5611C27.0422 0.857239 27.5036 1.04837 27.8438 1.38859C28.1841 1.7288 28.3752 2.19024 28.3752 2.67138V6.6612C28.3752 7.14234 28.1841 7.60377 27.8438 7.94399C27.5036 8.28421 27.0422 8.47534 26.5611 8.47534H23.7423L20.9459 11.035V8.47534H20.1012" stroke="#E3D6FF" stroke-width="1.27982" stroke-linecap="round" stroke-linejoin="round"/>
</g>
<defs>
<clipPath id="clip0_1_465">
<rect width="31.9954" height="31.9954" fill="white" transform="translate(0.859375 0.217285)"/>
</clipPath>
</defs>
</svg>
