<svg width="25" height="24" viewBox="0 0 25 24" fill="none" xmlns="http://www.w3.org/2000/svg">
<path d="M18.631 3.87354H19.3702C19.8249 3.87353 20.261 4.054 20.5828 4.37529C20.9045 4.69658 21.0856 5.13244 21.0862 5.58714V21.8039C21.0862 22.259 20.9054 22.6955 20.5836 23.0173C20.2618 23.3391 19.8253 23.5199 19.3702 23.5199H6.60223C6.14712 23.5199 5.71065 23.3391 5.38884 23.0173C5.06702 22.6955 4.88623 22.259 4.88623 21.8039V5.58714C4.88687 5.13244 5.06794 4.69658 5.38968 4.37529C5.71143 4.054 6.14753 3.87353 6.60223 3.87354H7.34143" stroke="#A989F5" stroke-width="0.75" stroke-linecap="round" stroke-linejoin="round"/>
<path d="M15.3219 2.71444C15.0819 -0.211155 10.9323 -0.316756 10.6515 2.71444H8.98828V6.14164H16.9851V2.71444H15.3219Z" stroke="#A989F5" stroke-width="0.75" stroke-linecap="round" stroke-linejoin="round"/>
<path d="M11.0425 13.5125L12.1965 14.6665L14.9446 11.9185" stroke="#A989F5" stroke-width="0.75" stroke-linecap="round" stroke-linejoin="round"/>
<path d="M18.6318 21.0648V6.1416" stroke="#A989F5" stroke-width="0.75" stroke-linecap="round" stroke-linejoin="round"/>
<path d="M7.34082 6.1416V21.0648H16.6" stroke="#A989F5" stroke-width="0.75" stroke-linecap="round" stroke-linejoin="round"/>
</svg>
