<svg width="1079" height="934" viewBox="0 0 1079 934" fill="none" xmlns="http://www.w3.org/2000/svg">
<g clip-path="url(#clip0_2025_6127)">
<path d="M249.149 449.68L247.919 455.28C247.519 457.1 246.039 458.48 244.189 458.74L238.519 459.56C237.529 459.7 237.479 461.13 238.459 461.35L244.049 462.58C245.869 462.98 247.249 464.46 247.519 466.31L248.349 471.98C248.499 472.96 249.919 473.01 250.129 472.03L251.369 466.45C251.769 464.63 253.249 463.25 255.099 462.98L260.759 462.14C261.749 462 261.809 460.59 260.829 460.37L255.239 459.13C253.419 458.73 252.039 457.25 251.769 455.4L250.949 449.75C250.799 448.75 249.379 448.7 249.159 449.68" fill="#FCA326"/>
<path d="M541.139 693.25L539.889 698.95C539.479 700.81 537.969 702.21 536.089 702.48L530.319 703.32C529.309 703.47 529.259 704.92 530.259 705.15L535.949 706.4C537.799 706.81 539.209 708.31 539.479 710.2L540.329 715.97C540.479 716.97 541.919 717.03 542.149 716.03L543.409 710.34C543.819 708.49 545.329 707.07 547.209 706.81L552.969 705.95C553.979 705.8 554.039 704.37 553.039 704.14L547.339 702.87C545.479 702.46 544.079 700.96 543.799 699.07L542.959 693.31C542.879 692.78 542.459 692.52 542.029 692.52C541.629 692.52 541.239 692.76 541.129 693.24" fill="url(#paint0_linear_2025_6127)"/>
<path d="M597.97 251.93H593.75M616.11 251.93H611.89M604.93 258.89V263.11M604.93 240.75V244.97" stroke="#FFA300" stroke-width="1.5" stroke-linecap="round" stroke-linejoin="round"/>
<path d="M455.069 162.15L461.059 168.14L474.529 154.67M494.659 189.41L498.399 193.15L494.659 196.89M497.649 193.16H480.429M464.719 193.16H437.019M447.039 187.71C439.799 182.78 434.729 174.9 433.549 165.8M433.549 157.53C435.409 143.49 446.539 132.38 460.589 130.54M468.819 130.54C482.879 132.37 494.019 143.49 495.889 157.53M495.889 165.81C493.879 181.24 480.689 193.15 464.709 193.15M499.479 163.43C498.529 165.27 496.279 165.99 494.439 165.04C492.599 164.09 491.879 161.84 492.829 160C493.779 158.16 496.029 157.44 497.869 158.39C499.709 159.34 500.429 161.59 499.479 163.43ZM437.019 161.72C437.019 163.79 435.339 165.46 433.279 165.46C431.219 165.46 429.539 163.78 429.539 161.72C429.539 159.66 431.219 157.98 433.279 157.98C435.339 157.98 437.019 159.65 437.019 161.72ZM464.719 126.53C466.789 126.53 468.459 128.21 468.459 130.27C468.459 132.33 466.789 134.01 464.719 134.01C462.649 134.01 460.979 132.33 460.979 130.27C460.979 128.21 462.659 126.53 464.719 126.53ZM433.279 189.41C435.349 189.41 437.019 191.09 437.019 193.15C437.019 195.21 435.339 196.89 433.279 196.89C431.219 196.89 429.539 195.21 429.539 193.15C429.539 191.09 431.219 189.41 433.279 189.41Z" stroke="#F79E26" stroke-width="1.5" stroke-miterlimit="10"/>
<path d="M430.18 447.63C430.18 482.12 458.14 510.08 492.63 510.08C527.12 510.08 555.08 482.12 555.08 447.63C555.08 413.14 527.12 385.18 492.63 385.18C458.14 385.18 430.18 413.14 430.18 447.63Z" fill="url(#paint1_linear_2025_6127)"/>
<path d="M488.012 457.32C486.542 457.32 485.352 456.13 485.352 454.66V452C485.352 450.53 486.542 449.34 488.012 449.34C489.482 449.34 490.672 450.53 490.672 452V454.66C490.672 456.13 489.482 457.32 488.012 457.32Z" stroke="white" stroke-width="1.5"/>
<path d="M472.051 457.32C470.581 457.32 469.391 456.13 469.391 454.66V452C469.391 450.53 470.581 449.34 472.051 449.34C473.521 449.34 474.711 450.53 474.711 452V454.66C474.711 456.13 473.521 457.32 472.051 457.32Z" stroke="white" stroke-width="1.5"/>
<path d="M503.969 457.32C502.499 457.32 501.309 456.13 501.309 454.66V452C501.309 450.53 502.499 449.34 503.969 449.34C505.439 449.34 506.629 450.53 506.629 452V454.66C506.629 456.13 505.439 457.32 503.969 457.32Z" stroke="white" stroke-width="1.5"/>
<path d="M501.308 416.1H495.988V441.36" stroke="white" stroke-width="1.5"/>
<path d="M482.691 416.1H488.011V441.36" stroke="white" stroke-width="1.5"/>
<path d="M503.969 441.36V428.06H514.599" stroke="white" stroke-width="1.5"/>
<path d="M480.031 441.36V428.06H469.391" stroke="white" stroke-width="1.5"/>
<path d="M465.4 432.05C467.604 432.05 469.39 430.264 469.39 428.06C469.39 425.856 467.604 424.07 465.4 424.07C463.197 424.07 461.41 425.856 461.41 428.06C461.41 430.264 463.197 432.05 465.4 432.05Z" stroke="white" stroke-width="1.5"/>
<path d="M478.701 420.09C480.905 420.09 482.691 418.304 482.691 416.1C482.691 413.896 480.905 412.11 478.701 412.11C476.497 412.11 474.711 413.896 474.711 416.1C474.711 418.304 476.497 420.09 478.701 420.09Z" stroke="white" stroke-width="1.5"/>
<path d="M505.299 420.09C507.502 420.09 509.289 418.304 509.289 416.1C509.289 413.896 507.502 412.11 505.299 412.11C503.095 412.11 501.309 413.896 501.309 416.1C501.309 418.304 503.095 420.09 505.299 420.09Z" stroke="white" stroke-width="1.5"/>
<path d="M518.592 432.05C520.795 432.05 522.582 430.264 522.582 428.06C522.582 425.856 520.795 424.07 518.592 424.07C516.388 424.07 514.602 425.856 514.602 428.06C514.602 430.264 516.388 432.05 518.592 432.05Z" stroke="white" stroke-width="1.5"/>
<path d="M495.988 457.32V449.34" stroke="white" stroke-width="1.5"/>
<path d="M480.031 457.32V449.34" stroke="white" stroke-width="1.5"/>
<path d="M511.941 457.32V449.34" stroke="white" stroke-width="1.5"/>
<path d="M517.262 457.32V449.34" stroke="white" stroke-width="1.5"/>
<path d="M506.629 470.62V462.64" stroke="white" stroke-width="1.5"/>
<path d="M469.391 470.62V462.64" stroke="white" stroke-width="1.5"/>
<path d="M490.672 470.62V462.64" stroke="white" stroke-width="1.5"/>
<path d="M485.352 470.62V462.64" stroke="white" stroke-width="1.5"/>
<path d="M498.648 470.62C500.118 470.62 501.308 469.43 501.308 467.96V465.3C501.308 463.83 500.118 462.64 498.648 462.64C497.178 462.64 495.988 463.83 495.988 465.3V467.96C495.988 469.43 497.178 470.62 498.648 470.62Z" stroke="white" stroke-width="1.5"/>
<path d="M514.601 470.62C516.071 470.62 517.261 469.43 517.261 467.96V465.3C517.261 463.83 516.071 462.64 514.601 462.64C513.131 462.64 511.941 463.83 511.941 465.3V467.96C511.941 469.43 513.131 470.62 514.601 470.62Z" stroke="white" stroke-width="1.5"/>
<path d="M477.371 470.62C478.841 470.62 480.031 469.43 480.031 467.96V465.3C480.031 463.83 478.841 462.64 477.371 462.64C475.901 462.64 474.711 463.83 474.711 465.3V467.96C474.711 469.43 475.901 470.62 477.371 470.62Z" stroke="white" stroke-width="1.5"/>
<path d="M525.242 470.62V474.61C525.242 476.81 523.452 478.6 521.252 478.6H517.262" stroke="white" stroke-width="1.5"/>
<path d="M461.41 449.34V445.35C461.41 443.15 463.2 441.36 465.4 441.36H469.39" stroke="white" stroke-width="1.5"/>
<path d="M461.41 470.62V474.61C461.41 476.81 463.2 478.6 465.4 478.6H469.39" stroke="white" stroke-width="1.5"/>
<path d="M525.242 449.34V445.35C525.242 443.15 523.452 441.36 521.252 441.36H517.262" stroke="white" stroke-width="1.5"/>
<path opacity="0.75" d="M543.512 248.43H477.512C471.437 248.43 466.512 253.355 466.512 259.43C466.512 265.505 471.437 270.43 477.512 270.43H543.512C549.587 270.43 554.512 265.505 554.512 259.43C554.512 253.355 549.587 248.43 543.512 248.43Z" stroke="url(#paint2_linear_2025_6127)" stroke-width="1.5" stroke-miterlimit="10"/>
<path opacity="0.25" d="M839.781 758.82H551.781C503.733 758.82 464.781 797.771 464.781 845.82C464.781 893.869 503.733 932.82 551.781 932.82H839.781C887.83 932.82 926.781 893.869 926.781 845.82C926.781 797.771 887.83 758.82 839.781 758.82Z" stroke="url(#paint3_linear_2025_6127)" stroke-width="1.5" stroke-miterlimit="10"/>
<path opacity="0.25" d="M953.25 0.75H652.25C623.255 0.75 599.75 24.2551 599.75 53.25V54.25C599.75 83.2449 623.255 106.75 652.25 106.75H953.25C982.245 106.75 1005.75 83.2449 1005.75 54.25V53.25C1005.75 24.2551 982.245 0.75 953.25 0.75Z" stroke="url(#paint4_linear_2025_6127)" stroke-width="1.5" stroke-miterlimit="10"/>
<path opacity="0.25" d="M1025.25 534.75H724.25C695.255 534.75 671.75 558.255 671.75 587.25V588.25C671.75 617.245 695.255 640.75 724.25 640.75H1025.25C1054.24 640.75 1077.75 617.245 1077.75 588.25V587.25C1077.75 558.255 1054.24 534.75 1025.25 534.75Z" stroke="url(#paint5_linear_2025_6127)" stroke-width="1.5" stroke-miterlimit="10"/>
<path opacity="0.75" d="M413.75 636.64H53.75C24.4789 636.64 0.75 660.369 0.75 689.64C0.75 718.911 24.4789 742.64 53.75 742.64H413.75C443.021 742.64 466.75 718.911 466.75 689.64C466.75 660.369 443.021 636.64 413.75 636.64Z" stroke="url(#paint6_linear_2025_6127)" stroke-width="1.5" stroke-miterlimit="10"/>
<path opacity="0.75" d="M477.602 108.72H293.602C264.33 108.72 240.602 132.449 240.602 161.72C240.602 190.991 264.33 214.72 293.602 214.72H477.602C506.873 214.72 530.602 190.991 530.602 161.72C530.602 132.449 506.873 108.72 477.602 108.72Z" stroke="url(#paint7_linear_2025_6127)" stroke-width="1.18" stroke-miterlimit="10"/>
<path d="M911.25 327.63H491.25C424.976 327.63 371.25 381.356 371.25 447.63C371.25 513.904 424.976 567.63 491.25 567.63H911.25C977.524 567.63 1031.25 513.904 1031.25 447.63C1031.25 381.356 977.524 327.63 911.25 327.63Z" stroke="url(#paint8_linear_2025_6127)" stroke-width="1.5" stroke-miterlimit="10"/>
<g opacity="0.75">
<path d="M250.201 812.68C244.031 812.68 239.031 818.05 239.031 824.68C239.031 831.31 244.031 836.68 250.201 836.68H251.861C258.031 836.68 263.031 831.31 263.031 824.68C263.031 818.05 258.031 812.68 251.861 812.68H250.201Z" stroke="#FCA326" stroke-width="1.5"/>
<path d="M291.221 812.68C285.051 812.68 280.051 818.05 280.051 824.68C280.051 831.31 285.051 836.68 291.221 836.68H292.881C299.051 836.68 304.051 831.31 304.051 824.68C304.051 818.05 299.051 812.68 292.881 812.68H291.221Z" stroke="#FCA326" stroke-width="1.5"/>
<path d="M209.19 812.68C203.02 812.68 198.02 818.05 198.02 824.68C198.02 831.31 203.02 836.68 209.19 836.68H210.85C217.02 836.68 222.02 831.31 222.02 824.68C222.02 818.05 217.02 812.68 210.85 812.68H209.19Z" stroke="#FCA326" stroke-width="1.5"/>
</g>
<g opacity="0.75">
<path d="M243.998 246.4C237.828 246.4 232.828 251.77 232.828 258.4C232.828 265.03 237.828 270.4 243.998 270.4H245.658C251.828 270.4 256.828 265.03 256.828 258.4C256.828 251.77 251.828 246.4 245.658 246.4H243.998Z" stroke="#A989F5" stroke-width="1.5"/>
<path d="M285.01 246.4C278.84 246.4 273.84 251.77 273.84 258.4C273.84 265.03 278.84 270.4 285.01 270.4H286.67C292.84 270.4 297.84 265.03 297.84 258.4C297.84 251.77 292.84 246.4 286.67 246.4H285.01Z" stroke="#A989F5" stroke-width="1.5"/>
<path d="M202.979 246.4C196.809 246.4 191.809 251.77 191.809 258.4C191.809 265.03 196.809 270.4 202.979 270.4H204.639C210.809 270.4 215.809 265.03 215.809 258.4C215.809 251.77 210.809 246.4 204.639 246.4H202.979Z" stroke="#A989F5" stroke-width="1.5"/>
</g>
<path opacity="0.5" d="M492.628 519.45C452.968 519.45 420.808 487.29 420.808 447.63C420.808 407.97 452.968 375.81 492.628 375.81C532.288 375.81 564.448 407.97 564.448 447.63C564.448 487.29 532.288 519.45 492.628 519.45ZM492.628 360.65C444.588 360.65 405.648 399.59 405.648 447.63C405.648 495.67 444.588 534.61 492.628 534.61C540.668 534.61 579.608 495.67 579.608 447.63C579.608 399.59 540.668 360.65 492.628 360.65Z" fill="url(#paint9_linear_2025_6127)"/>
<path opacity="0.25" d="M492.629 548.63C548.41 548.63 593.629 503.411 593.629 447.63C593.629 391.849 548.41 346.63 492.629 346.63C436.848 346.63 391.629 391.849 391.629 447.63C391.629 503.411 436.848 548.63 492.629 548.63Z" stroke="url(#paint10_linear_2025_6127)" stroke-width="1.5" stroke-miterlimit="10"/>
</g>
<defs>
<linearGradient id="paint0_linear_2025_6127" x1="529.529" y1="704.64" x2="553.749" y2="704.64" gradientUnits="userSpaceOnUse">
<stop stop-color="#A072FF"/>
<stop offset="0.97" stop-color="#F99000"/>
<stop offset="1" stop-color="#F99000"/>
</linearGradient>
<linearGradient id="paint1_linear_2025_6127" x1="430.18" y1="447.63" x2="555.08" y2="447.63" gradientUnits="userSpaceOnUse">
<stop stop-color="#8159C5"/>
<stop offset="1" stop-color="#FF9D71"/>
</linearGradient>
<linearGradient id="paint2_linear_2025_6127" x1="555.262" y1="259.43" x2="465.762" y2="259.43" gradientUnits="userSpaceOnUse">
<stop stop-color="#F99000"/>
<stop offset="0.03" stop-color="#F99000"/>
<stop offset="1" stop-color="#A072FF"/>
</linearGradient>
<linearGradient id="paint3_linear_2025_6127" x1="927.531" y1="845.82" x2="464.031" y2="845.82" gradientUnits="userSpaceOnUse">
<stop stop-color="#F99000"/>
<stop offset="0.03" stop-color="#F99000"/>
<stop offset="1" stop-color="#A072FF"/>
</linearGradient>
<linearGradient id="paint4_linear_2025_6127" x1="1006.5" y1="53.75" x2="599" y2="53.75" gradientUnits="userSpaceOnUse">
<stop stop-color="#F99000"/>
<stop offset="0.03" stop-color="#F99000"/>
<stop offset="1" stop-color="#A072FF"/>
</linearGradient>
<linearGradient id="paint5_linear_2025_6127" x1="1078.5" y1="587.75" x2="671" y2="587.75" gradientUnits="userSpaceOnUse">
<stop stop-color="#F99000"/>
<stop offset="0.03" stop-color="#F99000"/>
<stop offset="1" stop-color="#A072FF"/>
</linearGradient>
<linearGradient id="paint6_linear_2025_6127" x1="467.5" y1="689.64" x2="8.89473e-06" y2="689.64" gradientUnits="userSpaceOnUse">
<stop stop-color="#F99000"/>
<stop offset="0.03" stop-color="#F99000"/>
<stop offset="1" stop-color="#A072FF"/>
</linearGradient>
<linearGradient id="paint7_linear_2025_6127" x1="531.192" y1="161.72" x2="240.012" y2="161.72" gradientUnits="userSpaceOnUse">
<stop stop-color="#F99000"/>
<stop offset="0.03" stop-color="#F99000"/>
<stop offset="1" stop-color="#A072FF"/>
</linearGradient>
<linearGradient id="paint8_linear_2025_6127" x1="1032" y1="447.63" x2="370.5" y2="447.63" gradientUnits="userSpaceOnUse">
<stop stop-color="#A072FF"/>
<stop offset="0.97" stop-color="#F99000"/>
<stop offset="1" stop-color="#F99000"/>
</linearGradient>
<linearGradient id="paint9_linear_2025_6127" x1="405.648" y1="-9.25487e-05" x2="579.608" y2="-9.25487e-05" gradientUnits="userSpaceOnUse">
<stop stop-color="#8159C5"/>
<stop offset="1" stop-color="#FF9D71"/>
</linearGradient>
<linearGradient id="paint10_linear_2025_6127" x1="594.379" y1="447.63" x2="390.879" y2="447.63" gradientUnits="userSpaceOnUse">
<stop stop-color="#F99000"/>
<stop offset="0.03" stop-color="#F99000"/>
<stop offset="1" stop-color="#A072FF"/>
</linearGradient>
<clipPath id="clip0_2025_6127">
<rect width="1078.5" height="933.57" fill="white"/>
</clipPath>
</defs>
</svg>
