<svg width="105" height="22" viewBox="0 0 105 22" fill="none" xmlns="http://www.w3.org/2000/svg">
<path d="M33.6524 12.6563C33.6647 13.0512 33.6031 13.4338 33.4673 13.8042C33.3686 14.088 33.208 14.3348 32.986 14.5323C32.8008 14.6927 32.591 14.8161 32.3688 14.9026C32.1591 14.9765 31.9369 15.026 31.7271 15.026C31.4803 15.026 31.2334 14.9765 30.9989 14.8654C30.7521 14.7545 30.5423 14.5939 30.3695 14.3966C30.1597 14.1496 29.9993 13.8535 29.9129 13.5449C29.7895 13.1376 29.74 12.7056 29.74 12.2861V12.212L28.0615 12.6193V12.6686C28.0615 13.8165 28.3948 14.7545 29.0367 15.4578C29.6784 16.1613 30.5917 16.5316 31.7394 16.5316C32.8873 16.5316 33.8005 16.1737 34.4423 15.4702C35.084 14.7668 35.405 13.7794 35.405 12.5329V5.30054H33.6647V12.6563H33.6524Z" fill="white"/>
<path d="M42.082 12.5575C42.082 12.9278 42.0203 13.298 41.8723 13.6436C41.7612 13.9399 41.576 14.199 41.3415 14.4212C41.1316 14.6063 40.8848 14.7668 40.6255 14.8654C40.3788 14.9642 40.1197 15.0136 39.8605 15.026C39.4162 15.0383 38.9718 14.8777 38.6634 14.557C38.3548 14.2483 38.2067 13.7054 38.2067 12.9772V8.54639H36.5898V13.1006C36.5898 14.2483 36.8615 15.1122 37.3921 15.68C37.9229 16.2476 38.6757 16.5316 39.6383 16.5316C40.6255 16.5316 41.4526 16.0995 42.0696 15.2605V16.4081H43.6865V8.54639H42.0696V12.5575H42.082Z" fill="white"/>
<path d="M50.8818 12.4709C50.8942 13.1249 50.6844 13.7791 50.2647 14.2851C49.8821 14.7664 49.302 15.0379 48.6973 15.0256C48.1049 15.0256 47.5866 14.7664 47.1546 14.2728C46.7227 13.7666 46.4882 13.1372 46.5005 12.4709C46.4882 11.8167 46.7227 11.175 47.1422 10.6688C47.5743 10.1629 48.0802 9.91602 48.685 9.91602C49.2897 9.9037 49.8698 10.1752 50.2524 10.6565C50.6844 11.1626 50.8942 11.8167 50.8818 12.4709ZM48.9688 8.42274C48.4505 8.42274 47.9445 8.54616 47.4878 8.79298C47.1053 8.99035 46.772 9.27431 46.5128 9.61989V8.54616H44.896V19.8881H46.5128V15.297C46.7597 15.655 47.0929 15.9388 47.4755 16.1486C47.9322 16.3954 48.4505 16.5188 48.9688 16.5188C49.9439 16.5312 50.8571 16.0992 51.4866 15.3588C52.1653 14.5935 52.5109 13.6186 52.5109 12.4709C52.5109 11.323 52.1653 10.3604 51.499 9.59509C50.8571 8.84229 49.9316 8.41042 48.9688 8.42274Z" fill="white"/>
<path d="M63.5324 11.6072C63.8287 10.447 64.5938 9.85463 65.8158 9.85463C66.3218 9.8423 66.8031 10.015 67.1733 10.3606C67.5189 10.6815 67.7288 11.1259 67.7657 11.5947L63.5324 11.6072ZM68.6543 9.76819C68.4198 9.47206 68.136 9.21291 67.815 9.00306C67.5066 8.80554 67.1733 8.65747 66.8154 8.55871C66.4698 8.45995 66.0996 8.42297 65.7417 8.42297C64.5938 8.42297 63.6435 8.80554 62.9153 9.55834C62.1872 10.3113 61.8293 11.2863 61.8293 12.4711C61.8169 13.1746 61.9773 13.8781 62.2859 14.5075C62.5946 15.1122 63.0759 15.6182 63.656 15.9761C64.2977 16.3464 65.0258 16.5437 65.7663 16.5191C66.1612 16.5191 66.5439 16.4698 66.9265 16.3587C67.2474 16.2723 67.5559 16.1365 67.8398 15.9513C68.099 15.7909 68.3212 15.5936 68.5309 15.3714C68.7161 15.1739 68.8888 14.9518 69.0245 14.7173C69.1479 14.5075 69.259 14.2853 69.3454 14.0508L69.3701 13.9892L67.8274 13.5818L67.8027 13.6313C67.63 14.0262 67.3585 14.3718 67.0129 14.6432C66.655 14.9024 66.223 15.0381 65.791 15.0258C65.1123 15.0258 64.5568 14.8284 64.1373 14.4211C63.7299 14.0385 63.4708 13.5202 63.4215 12.9648H69.3578L69.3701 12.9155C69.3949 12.7303 69.4196 12.5451 69.4196 12.36C69.4196 11.8664 69.3454 11.3604 69.2097 10.8914C69.0986 10.484 68.9011 10.1138 68.6543 9.76819Z" fill="white"/>
<path d="M81.9087 15.0259C81.2298 15.0382 80.5635 14.8409 80.008 14.4706C79.4404 14.1002 78.9961 13.5696 78.6998 12.9649C78.3913 12.3107 78.2308 11.5825 78.2308 10.8544C78.2185 10.1262 78.379 9.39806 78.6998 8.74401C78.9837 8.1268 79.4404 7.60849 80.008 7.23825C81.1682 6.49778 82.6615 6.49778 83.8217 7.23825C84.3894 7.60849 84.8461 8.13928 85.1299 8.74401C85.4385 9.41038 85.5989 10.1262 85.5989 10.8544C85.6112 11.5825 85.4508 12.3107 85.1299 12.9649C84.8338 13.5819 84.3894 14.1002 83.8217 14.4706C83.2539 14.8409 82.5875 15.0382 81.9087 15.0259ZM85.858 6.84336C85.3767 6.32491 84.7843 5.90536 84.1426 5.63388C82.7233 5.04147 81.1189 5.04147 79.6996 5.63388C79.0454 5.91769 78.4653 6.32491 77.9963 6.84336C77.5274 7.37399 77.157 7.97873 76.9102 8.64525C76.3919 10.0646 76.3919 11.632 76.9102 13.0513C77.157 13.7177 77.5274 14.3224 77.9963 14.8532C78.4776 15.3715 79.0577 15.791 79.7119 16.0625C81.1312 16.6549 82.7356 16.6549 84.1549 16.0625C84.809 15.7787 85.389 15.3715 85.8704 14.8532C86.3517 14.3224 86.7219 13.7177 86.9688 13.0513C87.4872 11.632 87.4872 10.0646 86.9688 8.64525C86.7096 7.97873 86.3394 7.36167 85.858 6.84336Z" fill="white"/>
<path d="M92.5481 8.42297C92.2149 8.42297 91.8816 8.47228 91.5608 8.58337C91.2769 8.6698 91.0054 8.80554 90.7586 8.99073C90.5734 9.12647 90.4007 9.28687 90.2279 9.44726C90.1415 9.53369 90.0674 9.62013 89.9934 9.70656V8.55871H88.3643V16.408H89.981V12.3847C89.981 12.0144 90.0427 11.6442 90.1908 11.2986C90.3019 11.0025 90.4871 10.7432 90.7216 10.521C90.9313 10.336 91.1658 10.1756 91.4251 10.0768C91.6719 9.97804 91.9311 9.92873 92.1902 9.91626C92.6469 9.8916 93.0788 10.0645 93.3997 10.3853C93.696 10.7062 93.8564 11.2368 93.8564 11.9775V16.3957H95.4731V11.8417C95.4855 9.57082 94.4981 8.42297 92.5481 8.42297Z" fill="white"/>
<path d="M98.1259 11.6072C98.4221 10.447 99.1874 9.85463 100.409 9.85463C100.915 9.8423 101.396 10.015 101.767 10.3606C102.112 10.6815 102.322 11.1259 102.359 11.5947L98.1259 11.6072ZM103.976 12.9155C104.001 12.7303 104.025 12.5451 104.025 12.36C104.025 11.8664 103.951 11.3604 103.803 10.8914C103.68 10.484 103.494 10.1138 103.235 9.76819C103.001 9.47206 102.717 9.21291 102.396 9.00306C102.088 8.80554 101.754 8.65747 101.396 8.55871C101.051 8.45995 100.681 8.42297 100.323 8.42297C99.1749 8.42297 98.2245 8.80554 97.4964 9.55834C96.7682 10.3113 96.4103 11.2863 96.4103 12.4711C96.398 13.1746 96.5586 13.8781 96.867 14.5075C97.1756 15.1122 97.6446 15.6182 98.237 15.9761C98.8787 16.3464 99.6069 16.5437 100.347 16.5191C100.742 16.5191 101.125 16.4698 101.508 16.3587C101.828 16.2723 102.137 16.1365 102.421 15.9513C102.68 15.7909 102.902 15.5936 103.112 15.3714C103.297 15.1739 103.47 14.9518 103.606 14.7173C103.729 14.5075 103.84 14.2853 103.927 14.0508L103.951 13.9892L102.421 13.5818L102.396 13.6313C102.223 14.0262 101.952 14.3718 101.606 14.6432C101.248 14.9024 100.816 15.0381 100.385 15.0258C99.7057 15.0258 99.1502 14.8284 98.7307 14.4211C98.3233 14.0385 98.0642 13.5202 98.0149 12.9648H103.963L103.976 12.9155Z" fill="white"/>
<path d="M54.9177 9.05227C54.4612 9.18801 53.9799 9.18801 53.5232 9.05227L53.4121 9.01514V16.4572H55.0165V9.02762L54.9177 9.05227Z" fill="white"/>
<path d="M54.2388 5.72004C53.9548 5.70772 53.671 5.8188 53.4611 6.02865C53.2636 6.2385 53.1525 6.50998 53.165 6.79378C53.1525 7.07774 53.2636 7.36154 53.4611 7.55906C53.8932 7.97861 54.5842 7.97861 55.0162 7.55906C55.2137 7.34922 55.3248 7.07774 55.3123 6.79378C55.3248 6.50998 55.2137 6.2385 55.0162 6.02865C54.8064 5.8188 54.5226 5.70772 54.2388 5.72004Z" fill="white"/>
<path d="M59.1012 6.3374H57.6448V6.36205C57.6448 8.52186 56.1885 8.91675 56.0158 8.96621L55.9663 8.97853V10.0646H57.4104V13.7055C57.398 14.1251 57.4597 14.5323 57.5708 14.9396C57.6573 15.2481 57.793 15.5321 57.9904 15.7787C58.1632 15.9886 58.3854 16.1614 58.6199 16.2849C58.8544 16.4083 59.1136 16.4822 59.3727 16.5317C60.0268 16.6304 60.6933 16.6056 61.335 16.4699L61.3845 16.4576V14.8902L61.3473 14.9027C61.335 14.9027 60.1502 15.2481 59.5085 14.7668C59.237 14.5571 59.1012 14.2361 59.1012 13.8041V10.0646H61.3845V8.62062H59.1012V6.3374Z" fill="white"/>
<path d="M74.1588 8.54648C73.6529 8.64524 73.1839 8.85494 72.7766 9.16355C72.4804 9.38572 72.2335 9.66953 72.0608 10.0028V8.54648H70.4316V16.3958H72.0608V12.4587C72.0608 12.1256 72.1224 11.78 72.2459 11.4714C72.3569 11.1876 72.5298 10.9408 72.7643 10.7309C72.9865 10.5334 73.2456 10.3854 73.5171 10.2743C73.7886 10.1755 74.0726 10.1262 74.3564 10.1262H74.4428C74.7884 10.1385 75.134 10.2126 75.4547 10.3237L75.5165 10.3484L75.5289 10.2989C75.5658 9.71898 75.6769 9.15122 75.8498 8.59579L75.8621 8.57114L75.7634 8.54648C75.2326 8.44772 74.6896 8.44772 74.1588 8.54648Z" fill="white"/>
<path fill-rule="evenodd" clip-rule="evenodd" d="M2.60709 10.9318C2.60709 11.1403 2.62322 11.3648 2.63919 11.5731H5.23513C6.06828 11.5731 6.93354 11.5731 7.71876 11.3648C8.87239 11.0601 9.89789 10.4027 10.9716 9.69739L11.0036 9.68141C11.3562 9.42485 11.7407 9.2325 12.1574 9.10422C12.6862 8.95996 13.231 8.91187 13.7757 8.91187H19.7527C19.5603 8.09439 19.2558 7.30872 18.8232 6.58741H3.76087C3.00776 7.90189 2.60709 9.40887 2.60709 10.9318ZM17.8777 16.5586C14.7691 20.1977 9.28904 20.6466 5.65163 17.5205C5.29904 17.2158 4.97856 16.8952 4.69019 16.5586H17.8777ZM16.8687 12.8235C16.8687 13.6571 16.1796 14.3465 15.3463 14.3465C14.513 14.3465 13.8241 13.6571 13.8241 12.8235C13.8241 11.9899 14.513 11.3005 15.3463 11.3005C16.1796 11.3005 16.8687 11.9899 16.8687 12.8235ZM19.929 10.2104H13.7599C13.3433 10.1944 12.9106 10.2425 12.5101 10.3387C12.2216 10.4348 11.9492 10.5791 11.7089 10.7555L11.6768 10.7714L11.6728 10.774C10.5685 11.4947 9.4158 12.2468 8.05552 12.615C7.20624 12.8395 6.34098 12.8556 5.50767 12.8556H2.83169C3.02404 13.6891 3.34452 14.5067 3.77715 15.2441H18.8075C19.5766 13.9297 19.9771 12.4227 19.9611 10.8997C19.9611 10.6893 19.9471 10.479 19.9321 10.2554V10.2553L19.929 10.2104ZM5.65163 4.32702C9.30502 1.21689 14.7691 1.64983 17.8777 5.28876H4.69019C4.97856 4.95215 5.29904 4.61554 5.65163 4.32702ZM11.3569 21.5C17.156 21.5 21.8569 16.799 21.8569 11.0002C21.8569 5.20111 17.156 0.5 11.3569 0.5C5.55789 0.5 0.856934 5.20111 0.856934 11.0002C0.856934 16.799 5.55789 21.5 11.3569 21.5Z" fill="white"/>
</svg>
