<svg width="247" height="941" viewBox="0 0 247 941" fill="none" xmlns="http://www.w3.org/2000/svg">
<path opacity="0.3" d="M124.891 2L124.891 722" stroke="url(#paint0_linear_162_16905)" stroke-width="34" stroke-miterlimit="10"/>
<path d="M124.107 722L124.107 98.6296" stroke="url(#paint1_linear_162_16905)" stroke-width="6"/>
<path d="M123.868 2C117.806 2 111.744 3.33606 107.142 5.99582L14.0387 59.7476C9.73362 62.2341 7.3584 65.5001 7.3584 68.9392C7.3584 72.3783 9.73362 75.6442 14.0387 78.1308L107.13 131.883C116.359 137.214 131.365 137.214 140.593 131.883L233.685 78.1308C237.99 75.6442 240.365 72.3783 240.365 68.9392C240.365 65.5001 237.99 62.2341 233.685 59.7476L140.593 5.99582C135.979 3.33606 129.917 2 123.868 2Z" fill="url(#paint2_linear_162_16905)"/>
<path d="M123.868 2C117.806 2 111.744 3.33606 107.142 5.99581L14.0387 59.7476C9.73362 62.2341 7.3584 65.5001 7.3584 68.9392C7.3584 72.3783 9.73362 75.6442 14.0387 78.1308L107.13 131.883C116.359 137.214 131.365 137.214 140.593 131.883L233.685 78.1308C237.99 75.6442 240.365 72.3783 240.365 68.9392C240.365 65.5001 237.99 62.2341 233.685 59.7476L140.593 5.99581C135.979 3.33606 129.917 2 123.868 2Z" stroke="white" stroke-width="4" stroke-miterlimit="10"/>
<path d="M73.877 91.9617L164.333 39.7439" stroke="white" stroke-width="4" stroke-miterlimit="10"/>
<path d="M85.0234 101.858L114.813 84.6504" stroke="white" stroke-width="4" stroke-miterlimit="10"/>
<path d="M101.056 61.9495L155.018 30.6758" stroke="white" stroke-width="4" stroke-miterlimit="10"/>
<path d="M243.05 69.0754H243.037C243.037 69.2486 243.05 69.4217 243.037 69.6073C242.951 73.6031 240.266 77.5866 234.984 80.6422L143.228 133.516C132.49 139.701 114.998 139.701 104.26 133.516L12.5047 80.6298C7.13567 77.5371 4.45117 73.467 4.45117 69.397V97.2687C4.45117 101.339 7.13567 105.396 12.5047 108.502L104.26 161.375C114.998 167.56 132.49 167.56 143.228 161.375L234.984 108.502C240.266 105.458 242.951 101.475 243.037 97.4667C243.037 97.2935 243.037 97.1079 243.037 96.9347H243.05V69.063V69.0754Z" fill="url(#paint3_linear_162_16905)"/>
<path d="M76.4381 71.5L54.4179 84.2174L38.1748 74.8402L62.5456 60.7744L76.0794 68.5929C77.5763 69.4588 77.7371 70.7578 76.4381 71.5124V71.5Z" stroke="white" stroke-width="4" stroke-miterlimit="10"/>
<path d="M42.3812 60.3416L37.4576 63.1869C34.6494 64.8075 35.0081 67.6404 38.2493 69.5085L42.8266 72.1558L57.9068 63.4467L53.3295 60.7993C50.0883 58.9313 45.1894 58.721 42.3812 60.3416Z" stroke="white" stroke-width="4" stroke-miterlimit="10"/>
<path d="M208.065 73.5537C213.879 69.5455 213.558 63.5827 207.088 59.8467C200.234 55.888 189.076 55.9251 182.16 59.9085C180.923 60.626 179.921 61.4178 179.117 62.259C171.645 59.9209 162.07 60.5889 155.711 64.2631C148.215 68.5929 147.93 75.4835 154.87 79.9371C154.177 80.2216 153.522 80.5309 152.903 80.8896C146.977 84.3164 146.928 89.8338 152.804 93.2235C158.68 96.6131 168.243 96.5884 174.169 93.1616L200.952 77.6979" stroke="white" stroke-width="4" stroke-miterlimit="10"/>
<path d="M124.128 380.024C118.066 380.024 112.004 381.36 107.402 384.019L14.2985 437.771C9.99339 440.258 7.61816 443.524 7.61816 446.963C7.61816 450.402 9.99339 453.668 14.2985 456.154L107.39 509.906C116.619 515.238 131.625 515.238 140.853 509.906L233.945 456.154C238.25 453.668 240.625 450.402 240.625 446.963C240.625 443.524 238.25 440.258 233.945 437.771L140.853 384.019C136.239 381.36 130.177 380.024 124.128 380.024Z" fill="url(#paint4_linear_162_16905)"/>
<path d="M124.128 380.024C118.066 380.024 112.004 381.36 107.402 384.019L14.2985 437.771C9.99339 440.258 7.61816 443.524 7.61816 446.963C7.61816 450.402 9.99339 453.668 14.2985 456.154L107.39 509.906C116.619 515.238 131.625 515.238 140.853 509.906L233.945 456.154C238.25 453.668 240.625 450.402 240.625 446.963C240.625 443.524 238.25 440.258 233.945 437.771L140.853 384.019C136.239 381.36 130.177 380.024 124.128 380.024Z" stroke="white" stroke-width="4" stroke-miterlimit="10"/>
<path d="M74.1367 469.985L164.593 417.767" stroke="white" stroke-width="4" stroke-miterlimit="10"/>
<path d="M85.2832 479.882L115.072 462.674" stroke="white" stroke-width="4" stroke-miterlimit="10"/>
<path d="M101.315 439.973L155.277 408.699" stroke="white" stroke-width="4" stroke-miterlimit="10"/>
<path d="M243.309 447.099H243.297C243.297 447.272 243.309 447.445 243.297 447.631C243.21 451.627 240.526 455.61 235.243 458.666L143.488 511.539C132.75 517.725 115.258 517.725 104.52 511.539L12.7644 458.653C7.39543 455.561 4.71094 451.49 4.71094 447.42V475.292C4.71094 479.362 7.39543 483.42 12.7644 486.525L104.52 539.398C115.258 545.584 132.75 545.584 143.488 539.398L235.243 486.525C240.526 483.482 243.21 479.498 243.297 475.49C243.297 475.317 243.297 475.131 243.297 474.958H243.309V447.086V447.099Z" fill="url(#paint5_linear_162_16905)"/>
<path d="M76.6979 449.523L54.6776 462.241L38.4346 452.864L62.8053 438.798L76.3391 446.616C77.836 447.482 77.9969 448.781 76.6979 449.536V449.523Z" stroke="white" stroke-width="4" stroke-miterlimit="10"/>
<path d="M42.641 438.365L37.7174 441.21C34.9091 442.831 35.2679 445.664 38.5091 447.532L43.0863 450.179L58.1665 441.47L53.5893 438.823C50.3481 436.955 45.4492 436.744 42.641 438.365Z" stroke="white" stroke-width="4" stroke-miterlimit="10"/>
<path d="M208.325 451.577C214.139 447.569 213.818 441.606 207.348 437.87C200.494 433.911 189.335 433.949 182.42 437.932C181.183 438.649 180.181 439.441 179.377 440.282C171.905 437.944 162.33 438.612 155.971 442.287C148.474 446.616 148.19 453.507 155.13 457.961C154.437 458.245 153.781 458.554 153.163 458.913C147.237 462.34 147.188 467.857 153.064 471.247C158.94 474.637 168.503 474.612 174.429 471.185L201.212 455.721" stroke="white" stroke-width="4" stroke-miterlimit="10"/>
<path d="M244.626 404.427H244.614C244.614 404.6 244.626 404.786 244.614 404.971C244.527 409.041 241.806 413.087 236.437 416.179L143.345 469.931C132.447 476.228 114.707 476.228 103.808 469.931L10.729 416.179C5.27337 413.037 2.55176 408.905 2.55176 404.761V433.103C2.55176 437.235 5.27337 441.367 10.729 444.521L103.833 498.273C114.731 504.57 132.471 504.57 143.37 498.273L236.462 444.521C241.818 441.428 244.552 437.371 244.639 433.313C244.639 433.127 244.639 432.954 244.639 432.769H244.651V404.439L244.626 404.427Z" fill="url(#paint6_linear_162_16905)"/>
<path d="M244.614 403.19C244.614 403.375 244.626 403.548 244.614 403.734C244.527 407.804 241.806 411.849 236.437 414.942L143.345 468.694C132.447 474.991 114.707 474.991 103.808 468.694L10.729 414.942C5.27337 411.8 2.55176 407.668 2.55176 403.524" stroke="url(#paint7_linear_162_16905)" stroke-width="4" stroke-miterlimit="10"/>
<path opacity="0.3" d="M103.722 469.931L9.29472 415.412C-1.76491 409.029 -1.76491 398.65 9.29472 392.266L103.685 337.797C114.732 331.413 132.72 331.426 143.779 337.797L238.207 392.316C249.266 398.699 249.266 409.078 238.207 415.462L143.816 469.931C132.769 476.314 114.782 476.302 103.722 469.931Z" fill="url(#paint8_linear_162_16905)"/>
<path d="M124.128 776.603C118.066 776.603 112.004 777.939 107.402 780.599L14.2985 834.351C9.99339 836.838 7.61816 840.103 7.61816 843.543C7.61816 846.982 9.99339 850.248 14.2985 852.734L107.39 906.486C116.619 911.818 131.625 911.818 140.853 906.486L233.945 852.734C238.25 850.248 240.625 846.982 240.625 843.543C240.625 840.103 238.25 836.838 233.945 834.351L140.853 780.599C136.239 777.939 130.177 776.603 124.128 776.603Z" fill="url(#paint9_linear_162_16905)"/>
<path d="M124.128 776.603C118.066 776.603 112.004 777.939 107.402 780.599L14.2985 834.351C9.99339 836.838 7.61816 840.103 7.61816 843.543C7.61816 846.982 9.99339 850.248 14.2985 852.734L107.39 906.486C116.619 911.818 131.625 911.818 140.853 906.486L233.945 852.734C238.25 850.248 240.625 846.982 240.625 843.543C240.625 840.103 238.25 836.838 233.945 834.351L140.853 780.599C136.239 777.939 130.177 776.603 124.128 776.603Z" stroke="white" stroke-width="4" stroke-miterlimit="10"/>
<path d="M74.1367 866.565L164.593 814.347" stroke="white" stroke-width="4" stroke-miterlimit="10"/>
<path d="M85.2832 876.462L115.072 859.254" stroke="white" stroke-width="4" stroke-miterlimit="10"/>
<path d="M101.315 836.553L155.277 805.279" stroke="white" stroke-width="4" stroke-miterlimit="10"/>
<path d="M243.309 843.679H243.297C243.297 843.852 243.309 844.025 243.297 844.211C243.21 848.206 240.526 852.19 235.243 855.245L143.488 908.119C132.75 914.304 115.258 914.304 104.52 908.119L12.7644 855.233C7.39543 852.14 4.71094 848.07 4.71094 844V871.872C4.71094 875.942 7.39543 880 12.7644 883.105L104.52 935.978C115.258 942.164 132.75 942.164 143.488 935.978L235.243 883.105C240.526 880.062 243.21 876.078 243.297 872.07C243.297 871.897 243.297 871.711 243.297 871.538H243.309V843.666V843.679Z" fill="url(#paint10_linear_162_16905)"/>
<path d="M76.6979 846.103L54.6776 858.821L38.4346 849.443L62.8053 835.378L76.3391 843.196C77.836 844.062 77.9969 845.361 76.6979 846.116V846.103Z" stroke="white" stroke-width="4" stroke-miterlimit="10"/>
<path d="M42.641 834.945L37.7174 837.79C34.9091 839.411 35.2679 842.244 38.5091 844.112L43.0863 846.759L58.1665 838.05L53.5893 835.402C50.3481 833.534 45.4492 833.324 42.641 834.945Z" stroke="white" stroke-width="4" stroke-miterlimit="10"/>
<path d="M208.325 848.157C214.139 844.149 213.818 838.186 207.348 834.45C200.494 830.491 189.335 830.528 182.42 834.512C181.183 835.229 180.181 836.021 179.377 836.862C171.905 834.524 162.33 835.192 155.971 838.866C148.474 843.196 148.19 850.087 155.13 854.54C154.437 854.825 153.781 855.134 153.163 855.493C147.237 858.92 147.188 864.437 153.064 867.827C158.94 871.216 168.503 871.192 174.429 867.765L201.212 852.301" stroke="white" stroke-width="4" stroke-miterlimit="10"/>
<path d="M244.626 801.007H244.614C244.614 801.18 244.626 801.365 244.614 801.551C244.527 805.621 241.806 809.666 236.437 812.759L143.345 866.511C132.447 872.808 114.707 872.808 103.808 866.511L10.729 812.759C5.27337 809.617 2.55176 805.485 2.55176 801.341V829.682C2.55176 833.814 5.27337 837.946 10.729 841.101L103.833 894.853C114.731 901.149 132.471 901.149 143.37 894.853L236.462 841.101C241.818 838.008 244.552 833.95 244.639 829.893C244.639 829.707 244.639 829.534 244.639 829.348H244.651V801.019L244.626 801.007Z" fill="url(#paint11_linear_162_16905)"/>
<path d="M244.614 799.77C244.614 799.955 244.626 800.128 244.614 800.314C244.527 804.384 241.806 808.429 236.437 811.522L143.345 865.274C132.447 871.57 114.707 871.57 103.808 865.274L10.729 811.522C5.27337 808.38 2.55176 804.248 2.55176 800.104" stroke="url(#paint12_linear_162_16905)" stroke-width="4" stroke-miterlimit="10"/>
<path opacity="0.3" d="M103.722 866.511L9.29472 811.992C-1.76491 805.609 -1.76491 795.229 9.29472 788.846L103.685 734.377C114.732 727.993 132.72 728.006 143.779 734.377L238.207 788.895C249.266 795.279 249.266 805.658 238.207 812.041L143.816 866.511C132.769 872.894 114.782 872.882 103.722 866.511Z" fill="url(#paint13_linear_162_16905)"/>
<path d="M244.614 799.527C244.614 799.712 244.626 799.885 244.614 800.071C244.527 804.141 241.806 808.186 236.437 811.279L143.345 865.031C132.447 871.328 114.707 871.328 103.808 865.031L10.729 811.279C5.27337 808.137 2.55176 804.005 2.55176 799.861" stroke="url(#paint14_linear_162_16905)" stroke-width="2.47419" stroke-miterlimit="10"/>
<path opacity="0.3" d="M103.722 866.268L9.29472 811.749C-1.76491 805.366 -1.76491 794.987 9.29472 788.603L103.685 734.134C114.732 727.75 132.72 727.763 143.779 734.134L238.207 788.653C249.266 795.036 249.266 805.415 238.207 811.799L143.816 866.268C132.769 872.651 114.782 872.639 103.722 866.268Z" fill="url(#paint15_linear_162_16905)"/>
<path d="M103.821 865.686L10.7298 811.935C-0.169037 805.638 -0.169037 795.407 10.7298 789.11L103.821 735.359C114.72 729.062 132.46 729.062 143.359 735.359L236.45 789.11C247.349 795.407 247.349 805.638 236.45 811.935L143.359 865.686C132.46 871.983 114.72 871.983 103.821 865.686Z" fill="#2B2838"/>
<path d="M103.821 865.686L10.7298 811.935C-0.169037 805.638 -0.169037 795.407 10.7298 789.11L103.821 735.359C114.72 729.062 132.46 729.062 143.359 735.359L236.45 789.11C247.349 795.407 247.349 805.638 236.45 811.935L143.359 865.686C132.46 871.983 114.72 871.983 103.821 865.686Z" stroke="url(#paint16_linear_162_16905)" stroke-width="4" stroke-miterlimit="10"/>
<path d="M124.282 743.462L96.2002 727.243V759.668L124.282 775.886L152.352 759.668V727.243L124.282 743.462Z" fill="#C9B6FC"/>
<path d="M124.282 775.886L96.2002 759.668V727.243L124.282 743.462V775.886Z" fill="#8669E0"/>
<path d="M152.352 759.668L124.282 775.886V743.462L152.352 727.243V759.668Z" fill="#5C35D8"/>
<path d="M124.282 743.462L96.2002 727.243L124.27 711.037L152.352 727.243L124.282 743.462Z" fill="#A686F2"/>
<path d="M160.752 764.269L132.67 748.063V780.488L160.752 796.694L188.834 780.488V748.063L160.752 764.269Z" fill="#C9B6FC"/>
<path d="M160.752 796.694L132.67 780.488V748.063L160.752 764.269V796.694Z" fill="#8669E0"/>
<path d="M188.834 780.488L160.752 796.694V764.269L188.834 748.063V780.488Z" fill="#5C35D8"/>
<path d="M160.752 764.27L132.67 748.064L160.752 731.845L188.834 748.064L160.752 764.27Z" fill="#A686F2"/>
<path d="M197.222 785.077L169.14 768.871V801.296L197.222 817.502L225.304 801.296V768.871L197.222 785.077Z" fill="#C9B6FC"/>
<path d="M197.222 817.502L169.14 801.296V768.871L197.222 785.077V817.502Z" fill="#8669E0"/>
<path d="M225.304 801.296L197.222 817.502V785.078L225.304 768.872V801.296Z" fill="#5C35D8"/>
<path d="M197.222 785.078L169.14 768.872L197.222 752.653L225.304 768.872L197.222 785.078Z" fill="#A686F2"/>
<path d="M87.8008 765.68L59.7188 749.462V781.886L87.8008 798.104L115.883 781.886V749.462L87.8008 765.68Z" fill="#C9B6FC"/>
<path d="M87.8008 798.104L59.7188 781.886V749.462L87.8008 765.68V798.104Z" fill="#8669E0"/>
<path d="M115.883 781.886L87.8008 798.104V765.68L115.883 749.462V781.886Z" fill="#5C35D8"/>
<path d="M87.8008 765.68L59.7188 749.461L87.8008 733.255L115.883 749.461L87.8008 765.68Z" fill="#A686F2"/>
<path d="M124.282 786.488L96.2002 770.282V802.694L124.282 818.912L152.352 802.694V770.282L124.282 786.488Z" fill="#C9B6FC"/>
<path d="M124.282 818.912L96.2002 802.694V770.282L124.282 786.488V818.912Z" fill="#8669E0"/>
<path d="M152.352 802.694L124.282 818.912V786.488L152.352 770.282V802.694Z" fill="#5C35D8"/>
<path d="M124.282 786.488L96.2002 770.282L124.27 754.063L152.352 770.282L124.282 786.488Z" fill="#A686F2"/>
<path d="M160.752 807.296L132.67 791.09V823.514L160.752 839.72L188.834 823.514V791.09L160.752 807.296Z" fill="#C9B6FC"/>
<path d="M160.752 839.72L132.67 823.514V791.09L160.752 807.296V839.72Z" fill="#8669E0"/>
<path d="M188.834 823.514L160.752 839.72V807.296L188.834 791.09V823.514Z" fill="#5C35D8"/>
<path d="M160.752 807.296L132.67 791.09L160.752 774.872L188.834 791.09L160.752 807.296Z" fill="#A686F2"/>
<path d="M51.3311 787.898L23.249 771.68V804.104L51.3311 820.322L79.4131 804.104V771.68L51.3311 787.898Z" fill="#C9B6FC"/>
<path d="M51.3311 820.322L23.249 804.104V771.68L51.3311 787.898V820.322Z" fill="#8669E0"/>
<path d="M79.4131 804.104L51.3311 820.322V787.898L79.4131 771.68V804.104Z" fill="#5C35D8"/>
<path d="M51.3311 787.898L23.249 771.68L51.3311 755.474L79.4131 771.68L51.3311 787.898Z" fill="#A686F2"/>
<path d="M87.8008 808.706L59.7188 792.5V824.912L87.8008 841.13L115.883 824.912V792.5L87.8008 808.706Z" fill="#C9B6FC"/>
<path d="M87.8008 841.13L59.7188 824.912V792.5L87.8008 808.706V841.13Z" fill="#8669E0"/>
<path d="M115.883 824.912L87.8008 841.13V808.706L115.883 792.5V824.912Z" fill="#5C35D8"/>
<path d="M87.8008 808.706L59.7188 792.5L87.8008 776.282L115.883 792.5L87.8008 808.706Z" fill="#A686F2"/>
<path d="M124.282 829.514L96.2002 813.308V845.732L124.282 861.938L152.352 845.732V813.308L124.282 829.514Z" fill="#C9B6FC"/>
<path d="M124.282 861.938L96.2002 845.732V813.308L124.282 829.514V861.938Z" fill="#8669E0"/>
<path d="M152.352 845.732L124.282 861.938V829.514L152.352 813.308V845.732Z" fill="#5C35D8"/>
<path d="M124.282 829.514L96.2002 813.308L124.27 797.09L152.352 813.308L124.282 829.514Z" fill="#A686F2"/>
<defs>
<linearGradient id="paint0_linear_162_16905" x1="125.07" y1="722" x2="125.066" y2="-0.153607" gradientUnits="userSpaceOnUse">
<stop stop-color="#F9A026"/>
<stop offset="0.4241" stop-color="#A686F2"/>
<stop offset="0.7708" stop-color="#7759BF"/>
</linearGradient>
<linearGradient id="paint1_linear_162_16905" x1="126.108" y1="98.6297" x2="126.108" y2="1007.59" gradientUnits="userSpaceOnUse">
<stop stop-color="white"/>
<stop offset="1" stop-color="white" stop-opacity="0"/>
</linearGradient>
<linearGradient id="paint2_linear_162_16905" x1="123.868" y1="135.866" x2="123.868" y2="2" gradientUnits="userSpaceOnUse">
<stop stop-color="#2B2838"/>
<stop offset="0.46" stop-color="#1F1B2A"/>
<stop offset="0.7" stop-color="#171321"/>
</linearGradient>
<linearGradient id="paint3_linear_162_16905" x1="4.45117" y1="117.545" x2="243.05" y2="117.545" gradientUnits="userSpaceOnUse">
<stop stop-color="#F9A026" stop-opacity="0.1"/>
<stop offset="0.5" stop-color="#F9A026" stop-opacity="0.5"/>
<stop offset="0.77" stop-color="#7759BF" stop-opacity="0.5"/>
<stop offset="1" stop-color="#7759BF" stop-opacity="0.1"/>
</linearGradient>
<linearGradient id="paint4_linear_162_16905" x1="124.128" y1="513.89" x2="124.128" y2="380.024" gradientUnits="userSpaceOnUse">
<stop stop-color="#2B2838"/>
<stop offset="0.46" stop-color="#1F1B2A"/>
<stop offset="0.7" stop-color="#171321"/>
</linearGradient>
<linearGradient id="paint5_linear_162_16905" x1="4.71094" y1="495.568" x2="243.309" y2="495.568" gradientUnits="userSpaceOnUse">
<stop stop-color="#F9A026" stop-opacity="0.1"/>
<stop offset="0.5" stop-color="#F9A026" stop-opacity="0.5"/>
<stop offset="0.77" stop-color="#7759BF" stop-opacity="0.5"/>
<stop offset="1" stop-color="#7759BF" stop-opacity="0.1"/>
</linearGradient>
<linearGradient id="paint6_linear_162_16905" x1="2.55176" y1="453.7" x2="244.626" y2="453.7" gradientUnits="userSpaceOnUse">
<stop stop-color="#10AEAE" stop-opacity="0"/>
<stop offset="0.3" stop-color="#10AEAE" stop-opacity="0.8"/>
<stop offset="0.4" stop-color="#21B5B2" stop-opacity="0.8"/>
<stop offset="0.58" stop-color="#4EC8BD" stop-opacity="0.8"/>
<stop offset="0.7" stop-color="#6FD7C6" stop-opacity="0.8"/>
<stop offset="1" stop-color="#6FD7C6" stop-opacity="0"/>
</linearGradient>
<linearGradient id="paint7_linear_162_16905" x1="1.31466" y1="438.905" x2="245.863" y2="438.905" gradientUnits="userSpaceOnUse">
<stop stop-color="#10AEAE" stop-opacity="0.1"/>
<stop offset="0.25" stop-color="#10AEAE"/>
<stop offset="0.5" stop-color="#6FD7C6"/>
<stop offset="0.75" stop-color="#10AEAE"/>
<stop offset="1" stop-color="#10AEAE" stop-opacity="0.1"/>
</linearGradient>
<linearGradient id="paint8_linear_162_16905" x1="123.834" y1="474.902" x2="123.859" y2="333.016" gradientUnits="userSpaceOnUse">
<stop stop-color="#6FD7C6"/>
<stop offset="1" stop-color="#10AEAE"/>
</linearGradient>
<linearGradient id="paint9_linear_162_16905" x1="124.128" y1="910.469" x2="124.128" y2="776.603" gradientUnits="userSpaceOnUse">
<stop stop-color="#2B2838"/>
<stop offset="0.46" stop-color="#1F1B2A"/>
<stop offset="0.7" stop-color="#171321"/>
</linearGradient>
<linearGradient id="paint10_linear_162_16905" x1="4.71094" y1="892.148" x2="243.309" y2="892.148" gradientUnits="userSpaceOnUse">
<stop stop-color="#F9A026" stop-opacity="0.1"/>
<stop offset="0.5" stop-color="#F9A026" stop-opacity="0.5"/>
<stop offset="0.77" stop-color="#7759BF" stop-opacity="0.5"/>
<stop offset="1" stop-color="#7759BF" stop-opacity="0.1"/>
</linearGradient>
<linearGradient id="paint11_linear_162_16905" x1="2.55176" y1="850.28" x2="244.626" y2="850.28" gradientUnits="userSpaceOnUse">
<stop stop-color="#10AEAE" stop-opacity="0"/>
<stop offset="0.3" stop-color="#10AEAE" stop-opacity="0.8"/>
<stop offset="0.4" stop-color="#21B5B2" stop-opacity="0.8"/>
<stop offset="0.58" stop-color="#4EC8BD" stop-opacity="0.8"/>
<stop offset="0.7" stop-color="#6FD7C6" stop-opacity="0.8"/>
<stop offset="1" stop-color="#6FD7C6" stop-opacity="0"/>
</linearGradient>
<linearGradient id="paint12_linear_162_16905" x1="1.31466" y1="835.484" x2="245.863" y2="835.484" gradientUnits="userSpaceOnUse">
<stop stop-color="#10AEAE" stop-opacity="0.1"/>
<stop offset="0.25" stop-color="#10AEAE"/>
<stop offset="0.5" stop-color="#6FD7C6"/>
<stop offset="0.75" stop-color="#10AEAE"/>
<stop offset="1" stop-color="#10AEAE" stop-opacity="0.1"/>
</linearGradient>
<linearGradient id="paint13_linear_162_16905" x1="123.834" y1="871.482" x2="123.859" y2="729.596" gradientUnits="userSpaceOnUse">
<stop stop-color="#6FD7C6"/>
<stop offset="1" stop-color="#10AEAE"/>
</linearGradient>
<linearGradient id="paint14_linear_162_16905" x1="1.31466" y1="835.242" x2="245.863" y2="835.242" gradientUnits="userSpaceOnUse">
<stop stop-color="#10AEAE" stop-opacity="0.1"/>
<stop offset="0.25" stop-color="#10AEAE"/>
<stop offset="0.5" stop-color="#6FD7C6"/>
<stop offset="0.75" stop-color="#10AEAE"/>
<stop offset="1" stop-color="#10AEAE" stop-opacity="0.1"/>
</linearGradient>
<linearGradient id="paint15_linear_162_16905" x1="123.807" y1="871.287" x2="123.832" y2="729.414" gradientUnits="userSpaceOnUse">
<stop stop-color="#6FD7C6"/>
<stop offset="1" stop-color="#10AEAE"/>
</linearGradient>
<linearGradient id="paint16_linear_162_16905" x1="123.59" y1="871.649" x2="123.59" y2="729.408" gradientUnits="userSpaceOnUse">
<stop stop-color="#A686F2"/>
<stop offset="0.88" stop-color="#5829C8"/>
</linearGradient>
</defs>
</svg>
