<svg width="34" height="33" viewBox="0 0 34 33" fill="none" xmlns="http://www.w3.org/2000/svg">
<path d="M2.09082 21.5422C3.58379 26.1304 7.16623 29.9715 12.0985 31.5953C20.3235 34.3039 29.1824 29.8283 31.8889 21.5967C32.4751 19.816 32.724 18.0046 32.6728 16.2307" stroke="#171321" stroke-width="0.680851" stroke-miterlimit="10"/>
<path d="M31.8343 11.622C30.2971 7.13273 26.7521 3.3905 21.8983 1.79059C13.6767 -0.918005 4.81773 3.55766 2.11129 11.7858C1.52501 13.5631 1.27619 15.3711 1.32731 17.1416" stroke="#171321" stroke-width="0.680851" stroke-miterlimit="10"/>
<path d="M5.20963 22.6475L2.04303 21.6036L1 24.7729" stroke="#171321" stroke-width="0.680851" stroke-miterlimit="10"/>
<path d="M28.7905 10.7352L31.9571 11.7792L33.0002 8.60986" stroke="#171321" stroke-width="0.680851" stroke-miterlimit="10"/>
<path d="M20.4087 20.1026L23.8173 16.6913L20.4087 13.28" stroke="#171321" stroke-width="0.680851" stroke-miterlimit="10"/>
<path d="M13.5912 13.28L10.1826 16.6913L13.5912 20.1026" stroke="#171321" stroke-width="0.680851" stroke-miterlimit="10"/>
<path d="M18.7045 12.5977L15.2959 20.7848" stroke="#171321" stroke-width="0.680851" stroke-miterlimit="10"/>
</svg>
