<svg width="109" height="80" viewBox="0 0 109 80" fill="none" xmlns="http://www.w3.org/2000/svg">
<g clip-path="url(#clip0_60_2219)">
<path d="M107.878 77.4644C107.878 78.63 107.023 79.4123 106.009 79.4123V79.4052C104.967 79.4123 104.127 78.63 104.127 77.4647C104.127 76.2997 104.967 75.5195 106.009 75.5195C107.023 75.5192 107.878 76.2994 107.878 77.4644ZM108.637 77.4644C108.637 75.8645 107.394 74.9359 106.009 74.9359C104.615 74.9359 103.372 75.8645 103.372 77.4644C103.372 79.063 104.615 79.9953 106.009 79.9953C107.394 79.9953 108.637 79.063 108.637 77.4644ZM105.573 77.6783H105.855L106.507 78.8229H107.222L106.5 77.63C106.873 77.6035 107.18 77.426 107.18 76.9237C107.18 76.2994 106.75 76.0991 106.021 76.0991H104.967V78.8229H105.573L105.573 77.6783ZM105.573 77.2171V76.5615H105.995C106.224 76.5615 106.537 76.58 106.537 76.8598C106.537 77.1639 106.375 77.2171 106.105 77.2171H105.573ZM90.9431 63.5295L94.2189 72.4909H87.5658L90.9431 63.5295ZM87.4348 60.04L79.8856 79.1672H85.216L86.4101 75.7872H95.3441L96.4741 79.1672H102.261L94.6557 60.0376L87.4348 60.04ZM72.2786 79.1743H77.687V60.0342L72.2777 60.0329L72.2786 79.1743ZM34.7331 60.0329L30.2208 75.203L25.8983 60.0342L20.0628 60.0329L26.2362 79.1743H34.0277L40.2508 60.0329H34.7331ZM56.5942 64.2008H58.919C62.291 64.2008 64.4723 65.7148 64.4723 69.6438C64.4723 73.5734 62.291 75.0877 58.919 75.0877H56.5942V64.2008ZM51.2313 60.0329V79.1743H59.999C64.6704 79.1743 66.1961 78.3979 67.8455 76.6561C69.0105 75.433 69.7641 72.7484 69.7641 69.8144C69.7641 67.1231 69.1264 64.7238 68.0146 63.229C66.0116 60.5559 63.1258 60.0329 58.8188 60.0329H51.2313ZM0 60.0063V79.1743H5.45409V64.62L9.68011 64.6212C11.0794 64.6212 12.0769 64.9702 12.7507 65.6898C13.6054 66.6001 13.9544 68.0696 13.9544 70.7578V79.1743H19.2394V68.5839C19.2394 61.0255 14.4217 60.0063 9.70793 60.0063H0ZM42.527 60.0329L42.5292 79.1743H47.9351V60.0329H42.527Z" fill="black"/>
<path d="M14.5343 21.9205C14.5343 21.9205 21.4903 11.6574 35.3791 10.5957V6.87224C19.9955 8.10772 6.67383 21.1369 6.67383 21.1369C6.67383 21.1369 14.219 42.9483 35.3791 44.9458V40.988C19.8508 39.0345 14.5343 21.9205 14.5343 21.9205ZM35.3791 33.1171V36.7419C23.6432 34.6493 20.3855 22.45 20.3855 22.45C20.3855 22.45 26.0205 16.2077 35.3791 15.1954V19.1726C35.372 19.1726 35.3671 19.1704 35.3612 19.1704C30.4493 18.581 26.6121 23.1696 26.6121 23.1696C26.6121 23.1696 28.7628 30.894 35.3791 33.1171ZM35.3791 0.00463867V6.87224C35.8307 6.83762 36.2823 6.80826 36.7364 6.7928C54.2259 6.20335 65.6215 21.1369 65.6215 21.1369C65.6215 21.1369 52.5333 37.0519 38.8976 37.0519C37.6479 37.0519 36.478 36.936 35.3791 36.7413V40.988C36.351 41.1129 37.3298 41.1761 38.3097 41.1772C50.9986 41.1772 60.1749 34.6969 69.0603 27.0272C70.5335 28.207 76.5646 31.0773 77.8045 32.3335C69.3561 39.407 49.6667 45.1087 38.5041 45.1087C37.4281 45.1087 36.3948 45.0437 35.3791 44.9458V50.9129H83.6087V0.00463867H35.3791ZM35.3791 15.1954V10.5957C35.8261 10.5645 36.2764 10.5407 36.7364 10.5261C49.3131 10.1311 57.5642 21.3338 57.5642 21.3338C57.5642 21.3338 48.6522 33.7109 39.0967 33.7109C37.7215 33.7109 36.4885 33.4899 35.3788 33.1168V19.1723C40.275 19.7639 41.2604 21.9267 44.2039 26.8337L50.751 21.3134C50.751 21.3134 45.972 15.0458 37.9159 15.0458C37.0399 15.0455 36.2019 15.1073 35.3791 15.1954Z" fill="#77B900"/>
</g>
<defs>
<clipPath id="clip0_60_2219">
<rect width="108.637" height="80" fill="white"/>
</clipPath>
</defs>
</svg>
