        <svg xmlns="http://www.w3.org/2000/svg" width="12" height="10" viewBox="0 0 12 10" fill="none">
          <path d="M4.02879 9.73072C4.32771 9.72947 4.61416 9.61188 4.82639 9.40329L11.663 2.62887C11.7698 2.52391 11.8545 2.39903 11.9124 2.26145C11.9702 2.12386 12 1.97628 12 1.82723C12 1.67818 11.9702 1.5306 11.9124 1.39302C11.8545 1.25543 11.7698 1.13055 11.663 1.02559C11.4495 0.815302 11.1607 0.697266 10.8597 0.697266C10.5586 0.697266 10.2698 0.815302 10.0564 1.02559L4.02879 7.02095L1.94364 4.95475C1.73015 4.74446 1.44136 4.62643 1.14034 4.62643C0.839318 4.62643 0.550528 4.74446 0.337042 4.95475C0.230245 5.05972 0.145479 5.18459 0.0876313 5.32218C0.029784 5.45977 0 5.60734 0 5.75639C0 5.90544 0.029784 6.05302 0.0876313 6.19061C0.145479 6.32819 0.230245 6.45307 0.337042 6.55803L3.21979 9.41458C3.43668 9.62179 3.72755 9.73546 4.02879 9.73072Z" fill="white"/>
        </svg>
