<svg viewBox="0 0 30 30" fill="none" xmlns="http://www.w3.org/2000/svg">
<g clip-path="url(#clip0_126_12148)">
<path d="M14.6426 15V8.49468H9.67799L7.01025 5.82693V0.862305H0.504883V7.36767H5.48376L8.15154 10.0354V13.4736L5.48376 16.1413H0.504883V22.6467H7.01025V17.682L9.67799 15.0143H14.6426V15H14.6426ZM2.67331 3.03076H4.84176V5.19924H2.67331V3.03076ZM4.84176 20.464H2.67331V18.2955H4.84176V20.464Z" fill="#FFAE1A"/>
<path d="M21.847 29.1378H18.9795V15H21.847V15.856C22.3035 15.2996 23.3306 14.7718 24.4291 14.7718C27.4393 14.7718 29.1369 17.2683 29.1369 20.1787C29.1369 23.0889 27.425 25.557 24.4291 25.557C23.3163 25.557 22.3035 25.0291 21.847 24.4727V29.1378H21.847ZM21.847 21.862C22.1894 22.5753 22.9598 23.0604 23.7872 23.0604C25.3422 23.0604 26.2552 21.8192 26.2552 20.1786C26.2552 18.5095 25.3279 17.2683 23.7872 17.2683C22.9312 17.2683 22.1894 17.7819 21.847 18.4667V21.862Z" fill="black"/>
</g>
<defs>
<clipPath id="clip0_126_12148">
<rect width="80" height="28.3299" fill="white" transform="translate(0.5 0.835083)"/>
</clipPath>
</defs>
</svg>
