{
    "header": "Hai problemi a visualizzare o a inviare questo modulo?",
    "before_button": "Potresti dover aggiornare le ",
    "button_text": "Impostazioni dei cookie",
    "after_button": " in modo da consentire tutti i cookie. Potresti anche dover aggiungere GitLab ai siti consentiti nelle impostazioni della privacy dell'adblocker, del firewall o del browser che utilizzi."
}
