{
    "header": "¿Tiene problemas para ver o enviar este formulario?",
    "before_button": "Es probable que tenga que actualizar su ",
    "button_text": "configuración de cookies",
    "after_button": " para permitir todas las cookies. Asimismo, es posible que deba autorizarnos en su bloqueador de anuncios, firewall o configuración de privacidad del navegador."
}
