<svg width="15" height="16" viewBox="0 0 15 16" fill="none" xmlns="http://www.w3.org/2000/svg">
<path id="Vector" d="M7.10899 1.05241L6.49055 4.5498C6.28815 5.68849 5.42233 6.57156 4.33162 6.7807L0.947042 7.41976C0.351088 7.53595 0.351088 8.41902 0.947042 8.52359L4.33162 9.16265C5.43357 9.37179 6.28815 10.2665 6.49055 11.3935L7.10899 14.8909C7.22144 15.5068 8.07601 15.5068 8.17721 14.8909L8.79566 11.3935C8.99806 10.2549 9.86388 9.37179 10.9546 9.16265L14.3392 8.52359C14.9351 8.4074 14.9351 7.52433 14.3392 7.41976L10.9546 6.7807C9.85264 6.57156 8.99806 5.67687 8.79566 4.5498L8.17721 1.05241C8.06477 0.436591 7.21019 0.436591 7.10899 1.05241Z" fill="#171321"/>
</svg>
