{
  "schema_version": 18,
  "standard_lib_version": 40,
  "action_runtime_version": 5,
  "name": "User Attestation Module",
  "description": "User Attestation Module, updated for Devo",
  "guid": "10e88b14bafc22a7bbbfacce667460d3",
  "slug": "user_attestation_module",
  "agents": [
    {
      "type": "Agents::WebhookAgent",
      "name": "Incoming Webhook",
      "disabled": false,
      "description": "",
      "guid": "e8576e7ee35161792c82f96d2d7b2ebe",
      "origin_story_identifier": "cloud:44e6aef1c1247750fc1a53ae007b2d4c:7033f57391ddd14e63c855c3c2dba8a9",
      "options": {
        "secret": "5c546a11ce34a14757697ed5e428f4be",
        "verbs": "get,post",
        "path": "c11534a386afee13d255db7316a6fed7"
      },
      "reporting": {
        "time_saved_value": 0,
        "time_saved_unit": "minutes"
      },
      "monitoring": {
        "monitor_all_events": true,
        "monitor_failures": false,
        "monitor_no_events_emitted": 86400
      },
      "template": {
        "created_from_template_guid": null,
        "created_from_template_version": null
      },
      "visuals": {
        "card_icon_image_contents": null,
        "card_icon_image_filename": null,
        "card_icon_name": null
      },
      "width": null
    },
    {
      "type": "Agents::HTTPRequestAgent",
      "name": "Gitlab Info",
      "disabled": false,
      "description": null,
      "guid": "7a4410016f29d0f0a59a54b577406aac",
      "origin_story_identifier": "cloud:44e6aef1c1247750fc1a53ae007b2d4c:7033f57391ddd14e63c855c3c2dba8a9",
      "options": {
        "url": "http://34.66.143.75//api/v4/users/<<parse_alertcontext.message.user_id>>",
        "content_type": "application/json",
        "method": "get",
        "headers": {
          "Private-Token": "<<CREDENTIAL.gl_read_user>>"
        }
      },
      "reporting": {
        "time_saved_value": 0,
        "time_saved_unit": "minutes"
      },
      "monitoring": {
        "monitor_all_events": false,
        "monitor_failures": false,
        "monitor_no_events_emitted": 86400
      },
      "template": {
        "created_from_template_guid": null,
        "created_from_template_version": null
      },
      "visuals": {
        "card_icon_image_contents": null,
        "card_icon_image_filename": null,
        "card_icon_name": null
      },
      "width": null,
      "schedule": null
    },
    {
      "type": "Agents::HTTPRequestAgent",
      "name": "Search User by Email in Slack",
      "disabled": false,
      "description": null,
      "guid": "b78b2f045cd908510cfa7452ee90ba15",
      "origin_story_identifier": "cloud:44e6aef1c1247750fc1a53ae007b2d4c:7033f57391ddd14e63c855c3c2dba8a9",
      "options": {
        "url": "https://slack.com/api/users.lookupByEmail",
        "content_type": "application/json",
        "method": "get",
        "payload": {
          "email": "<<em>>"
        },
        "headers": {
          "Authorization": "Bearer xoxb-5579698652850-5796826668944-O5JAwEHoYdE3NOfBsLO2F8iV"
        }
      },
      "reporting": {
        "time_saved_value": 0,
        "time_saved_unit": "minutes"
      },
      "monitoring": {
        "monitor_all_events": false,
        "monitor_failures": false,
        "monitor_no_events_emitted": null
      },
      "template": {
        "created_from_template_guid": null,
        "created_from_template_version": null
      },
      "visuals": {
        "card_icon_image_contents": null,
        "card_icon_image_filename": null,
        "card_icon_name": null
      },
      "width": null,
      "schedule": null
    },
    {
      "type": "Agents::HTTPRequestAgent",
      "name": "Post Message to User using a Rich Notification",
      "disabled": false,
      "description": null,
      "guid": "ba9c9024cb07787f0035a74e430c959c",
      "origin_story_identifier": "cloud:44e6aef1c1247750fc1a53ae007b2d4c:7033f57391ddd14e63c855c3c2dba8a9",
      "options": {
        "url": "https://slack.com/api/chat.postMessage",
        "content_type": "json",
        "method": "post",
        "payload": {
          "channel": "<<search_user_by_email_in_slack.body.user.id>>",
          "attachments": [
            {
              "blocks": [
                {
                  "type": "section",
                  "text": {
                    "type": "mrkdwn",
                    "text": "SIRT detected an event: \n`<<incoming_webhook.body.alert_name>>`"
                  }
                },
                {
                  "type": "section",
                  "fields": [
                    {
                      "type": "mrkdwn",
                      "text": "*Actor:*\n<<parse_alertcontext.message.meta_user>>"
                    },
                    {
                      "type": "mrkdwn",
                      "text": "*Alert Time:*\n<<parse_alertcontext.message.eventdate>>"
                    },
                    {
                      "type": "mrkdwn",
                      "text": "*User Agent (if applicable):*\n<<BASE64URL_DECODE(parse_alertcontext.message.ua)>>"
                    },
                    {
                      "type": "mrkdwn",
                      "text": "*IP Address:*\n<<parse_alertcontext.message.remote_ip>>"
                    }
                  ]
                },
                {
                  "type": "actions",
                  "elements": [
                    {
                      "type": "button",
                      "text": {
                        "type": "plain_text",
                        "emoji": true,
                        "text": "This Was Me"
                      },
                      "style": "primary",
                      "value": "<<JSON(strip_alertcontext) |>JSON(%)>>"
                    },
                    {
                      "type": "button",
                      "text": {
                        "type": "plain_text",
                        "emoji": true,
                        "text": "I don't recognize this"
                      },
                      "style": "danger",
                      "value": "<<JSON(strip_alertcontext) |>JSON(%)>>"
                    }
                  ]
                }
              ]
            }
          ]
        },
        "headers": {
          "Authorization": "Bearer xoxb-5579698652850-5796826668944-O5JAwEHoYdE3NOfBsLO2F8iV"
        }
      },
      "reporting": {
        "time_saved_value": 0,
        "time_saved_unit": "minutes"
      },
      "monitoring": {
        "monitor_all_events": false,
        "monitor_failures": false,
        "monitor_no_events_emitted": null
      },
      "template": {
        "created_from_template_guid": null,
        "created_from_template_version": null
      },
      "visuals": {
        "card_icon_image_contents": null,
        "card_icon_image_filename": null,
        "card_icon_name": null
      },
      "width": null,
      "schedule": null
    },
    {
      "type": "Agents::TriggerAgent",
      "name": "email not found in Slack",
      "disabled": false,
      "description": null,
      "guid": "8f53cb167cc956df3fd12acdefd35acc",
      "origin_story_identifier": "cloud:44e6aef1c1247750fc1a53ae007b2d4c:7033f57391ddd14e63c855c3c2dba8a9",
      "options": {
        "rules": [
          {
            "type": "field==value",
            "value": "users_not_found",
            "path": "<<search_user_by_email_in_slack.body.error>>"
          }
        ]
      },
      "reporting": {
        "time_saved_value": 0,
        "time_saved_unit": "minutes"
      },
      "monitoring": {
        "monitor_all_events": false,
        "monitor_failures": false,
        "monitor_no_events_emitted": null
      },
      "template": {
        "created_from_template_guid": null,
        "created_from_template_version": null
      },
      "visuals": {
        "card_icon_image_contents": null,
        "card_icon_image_filename": null,
        "card_icon_name": null
      },
      "width": null
    },
    {
      "type": "Agents::EventTransformationAgent",
      "name": "1 hr Delay",
      "disabled": false,
      "description": null,
      "guid": "c67fe198b216335e7e158e08d8c19884",
      "origin_story_identifier": "cloud:44e6aef1c1247750fc1a53ae007b2d4c:7033f57391ddd14e63c855c3c2dba8a9",
      "options": {
        "mode": "delay",
        "seconds": "3600"
      },
      "reporting": {
        "time_saved_value": 0,
        "time_saved_unit": "minutes"
      },
      "monitoring": {
        "monitor_all_events": false,
        "monitor_failures": false,
        "monitor_no_events_emitted": null
      },
      "template": {
        "created_from_template_guid": null,
        "created_from_template_version": null
      },
      "visuals": {
        "card_icon_image_contents": null,
        "card_icon_image_filename": null,
        "card_icon_name": null
      },
      "width": null
    },
    {
      "type": "Agents::HTTPRequestAgent",
      "name": "Timeout",
      "disabled": false,
      "description": null,
      "guid": "91bd34fab52493b24342650a6cac312b",
      "origin_story_identifier": "cloud:44e6aef1c1247750fc1a53ae007b2d4c:7033f57391ddd14e63c855c3c2dba8a9",
      "options": {
        "url": "https://aged-wildflower-6995.tines.io/webhook/0b2645524d731bd6b8c634617c4e3f6c/83e5cd5a2a00a942e9ebc18b03d66ab6",
        "content_type": "json",
        "method": "post",
        "payload": {
          "alert": "<<JSON(incoming_webhook.body.alertContext) |> JSON(%)>>",
          "payload": {
            "type": "=\"block_actions\"",
            "alert_context": "=JSON_PARSE(incoming_webhook.body.alertContext)",
            "response": "timeout",
            "link_info": "=JSON_PARSE(incoming_webhook.body)",
            "alertId": "=incoming_webhook.body.alertName",
            "channel_id": "=search_user_by_email_in_slack.body.user.id",
            "devo_alert_id": "<<incoming_webhook.body.devo_alert_id>>",
            "message": "<<incoming_webhook.body.message>>"
          },
          "actor": "<<incoming_webhook.body.actor>>",
          "srcip": "<<incoming_webhook.body.srcIp>>",
          "eventTime": "<<incoming_webhook.body.eventTime>>"
        }
      },
      "reporting": {
        "time_saved_value": 0,
        "time_saved_unit": "minutes"
      },
      "monitoring": {
        "monitor_all_events": false,
        "monitor_failures": false,
        "monitor_no_events_emitted": null
      },
      "template": {
        "created_from_template_guid": null,
        "created_from_template_version": null
      },
      "visuals": {
        "card_icon_image_contents": null,
        "card_icon_image_filename": null,
        "card_icon_name": null
      },
      "width": null,
      "schedule": null
    },
    {
      "type": "Agents::TriggerAgent",
      "name": "User found",
      "disabled": false,
      "description": null,
      "guid": "22bdbd522ca3d1bd5a046d91b58ccf45",
      "origin_story_identifier": "cloud:44e6aef1c1247750fc1a53ae007b2d4c:7033f57391ddd14e63c855c3c2dba8a9",
      "options": {
        "rules": [
          {
            "type": "field!=value",
            "value": "users_not_found",
            "path": "<<search_user_by_email_in_slack.body.error>>"
          }
        ]
      },
      "reporting": {
        "time_saved_value": 0,
        "time_saved_unit": "minutes"
      },
      "monitoring": {
        "monitor_all_events": false,
        "monitor_failures": false,
        "monitor_no_events_emitted": null
      },
      "template": {
        "created_from_template_guid": null,
        "created_from_template_version": null
      },
      "visuals": {
        "card_icon_image_contents": null,
        "card_icon_image_filename": null,
        "card_icon_name": null
      },
      "width": null
    },
    {
      "type": "Agents::EventTransformationAgent",
      "name": "Test action",
      "disabled": false,
      "description": null,
      "guid": "4c1c2b6b67557586af2ff5021383a20b",
      "origin_story_identifier": "cloud:44e6aef1c1247750fc1a53ae007b2d4c:7033f57391ddd14e63c855c3c2dba8a9",
      "options": {
        "mode": "message_only",
        "payload": {
          "message": "This is an automatically generated message from Tines"
        }
      },
      "reporting": {
        "time_saved_value": 0,
        "time_saved_unit": "minutes"
      },
      "monitoring": {
        "monitor_all_events": false,
        "monitor_failures": false,
        "monitor_no_events_emitted": null
      },
      "template": {
        "created_from_template_guid": null,
        "created_from_template_version": null
      },
      "visuals": {
        "card_icon_image_contents": null,
        "card_icon_image_filename": null,
        "card_icon_name": null
      },
      "width": null,
      "schedule": null
    },
    {
      "type": "Agents::TriggerAgent",
      "name": "check if email domain is gitlab.com",
      "disabled": false,
      "description": null,
      "guid": "e92010ba2fdcbc0e3023951365515cc6",
      "origin_story_identifier": "cloud:44e6aef1c1247750fc1a53ae007b2d4c:7033f57391ddd14e63c855c3c2dba8a9",
      "options": {
        "rules": [
          {
            "type": "regex",
            "value": "@gitlab\\.com",
            "path": "<<REMOVE(gitlab_info.body.email, \"+admin\")>>"
          }
        ]
      },
      "reporting": {
        "time_saved_value": 0,
        "time_saved_unit": "minutes"
      },
      "monitoring": {
        "monitor_all_events": false,
        "monitor_failures": false,
        "monitor_no_events_emitted": null
      },
      "template": {
        "created_from_template_guid": null,
        "created_from_template_version": null
      },
      "visuals": {
        "card_icon_image_contents": null,
        "card_icon_image_filename": null,
        "card_icon_name": null
      },
      "width": null
    },
    {
      "type": "Agents::TriggerAgent",
      "name": "Trigger Action",
      "disabled": false,
      "description": null,
      "guid": "81847e61b9fa2cb141701f68108d34c5",
      "origin_story_identifier": "cloud:44e6aef1c1247750fc1a53ae007b2d4c:7033f57391ddd14e63c855c3c2dba8a9",
      "options": {
        "rules": [
          {
            "type": "!regex",
            "value": "This is an automatically generated message from Tines",
            "path": "<<test_action.message>>"
          }
        ]
      },
      "reporting": {
        "time_saved_value": 0,
        "time_saved_unit": "minutes"
      },
      "monitoring": {
        "monitor_all_events": false,
        "monitor_failures": false,
        "monitor_no_events_emitted": null
      },
      "template": {
        "created_from_template_guid": null,
        "created_from_template_version": null
      },
      "visuals": {
        "card_icon_image_contents": null,
        "card_icon_image_filename": null,
        "card_icon_name": null
      },
      "width": null
    },
    {
      "type": "Agents::EventTransformationAgent",
      "name": "Parse alertContext",
      "disabled": false,
      "description": null,
      "guid": "d41a3b61f3df1c8aa91d8d20bc2d5bcf",
      "origin_story_identifier": "cloud:44e6aef1c1247750fc1a53ae007b2d4c:7033f57391ddd14e63c855c3c2dba8a9",
      "options": {
        "mode": "message_only",
        "loop": false,
        "payload": {
          "message": "=JSON_PARSE(incoming_webhook.body.context)"
        }
      },
      "reporting": {
        "time_saved_value": 0,
        "time_saved_unit": "minutes"
      },
      "monitoring": {
        "monitor_all_events": false,
        "monitor_failures": false,
        "monitor_no_events_emitted": null
      },
      "template": {
        "created_from_template_guid": null,
        "created_from_template_version": null
      },
      "visuals": {
        "card_icon_image_contents": null,
        "card_icon_image_filename": null,
        "card_icon_name": null
      },
      "width": null,
      "schedule": null
    },
    {
      "type": "Agents::TriggerAgent",
      "name": "actor root",
      "disabled": false,
      "description": null,
      "guid": "ae1c8cb1dadd2eb0f5eefeeb4948d2f8",
      "origin_story_identifier": "cloud:44e6aef1c1247750fc1a53ae007b2d4c:7033f57391ddd14e63c855c3c2dba8a9",
      "options": {
        "rules": [
          {
            "type": "field==value",
            "value": "root",
            "path": "<<parse_alertcontext.message.meta_user>>"
          }
        ]
      },
      "reporting": {
        "time_saved_value": 0,
        "time_saved_unit": "minutes"
      },
      "monitoring": {
        "monitor_all_events": false,
        "monitor_failures": false,
        "monitor_no_events_emitted": null
      },
      "template": {
        "created_from_template_guid": null,
        "created_from_template_version": null
      },
      "visuals": {
        "card_icon_image_contents": null,
        "card_icon_image_filename": null,
        "card_icon_name": null
      },
      "width": null
    },
    {
      "type": "Agents::HTTPRequestAgent",
      "name": "Post message copy to sirt-detections channel (PROJECT OAK)",
      "disabled": false,
      "description": null,
      "guid": "2dd13a2445eb31e1b3fadab7d6c33709",
      "origin_story_identifier": "cloud:44e6aef1c1247750fc1a53ae007b2d4c:7033f57391ddd14e63c855c3c2dba8a9",
      "options": {
        "url": "https://slack.com/api/chat.postMessage",
        "content_type": "json",
        "method": "post",
        "payload": {
          "channel": "<<search_user_by_email_in_slack.body.user.id>>",
          "attachments": [
            {
              "blocks": [
                {
                  "type": "section",
                  "text": {
                    "type": "mrkdwn",
                    "text": "*[Copy of UAM event sent to user]* SIRT detected an event: \n`<<incoming_webhook.body.alertName>>`"
                  }
                },
                {
                  "type": "section",
                  "fields": [
                    {
                      "type": "mrkdwn",
                      "text": "*Actor:*\n<<incoming_webhook.body.actor>>"
                    },
                    {
                      "type": "mrkdwn",
                      "text": "*Alert Time:*\n<<incoming_webhook.body.eventTime>>"
                    },
                    {
                      "type": "mrkdwn",
                      "text": "*User Agent (if applicable):*\n<<parse_alert_context.message.client.userAgent.rawUserAgent>>"
                    },
                    {
                      "type": "mrkdwn",
                      "text": "*IP Address:*\n<<incoming_webhook.body.srcIp>>"
                    }
                  ]
                }
              ]
            }
          ]
        },
        "headers": {
          "Authorization": "Bearer <<CREDENTIAL.slack_token>>"
        }
      },
      "reporting": {
        "time_saved_value": 0,
        "time_saved_unit": "minutes"
      },
      "monitoring": {
        "monitor_all_events": false,
        "monitor_failures": false,
        "monitor_no_events_emitted": null
      },
      "template": {
        "created_from_template_guid": null,
        "created_from_template_version": null
      },
      "visuals": {
        "card_icon_image_contents": null,
        "card_icon_image_filename": null,
        "card_icon_name": null
      },
      "width": null,
      "schedule": null
    },
    {
      "type": "Agents::EventTransformationAgent",
      "name": "strip alertcontext",
      "disabled": false,
      "description": null,
      "guid": "a29b5fe1ff6657f9df37faa7f81dced5",
      "origin_story_identifier": "cloud:44e6aef1c1247750fc1a53ae007b2d4c:7033f57391ddd14e63c855c3c2dba8a9",
      "options": {
        "mode": "message_only",
        "loop": false,
        "payload": {
          "alertContext": {
            "actor": "<<parse_alertcontext.message.meta_user>>",
            "gitlab_com": "<<\"yes\">>",
            "remote_ip": "<<URL_DECODE(parse_alertcontext.message.remote_ip)>>",
            "userid": "<<parse_alertcontext.message.meta_user_id>>",
            "name": "<<incoming_webhook.body.alert_name>>"
          },
          "title": "<<incoming_webhook.body.alert_name>>",
          "link": "<<\"https://eu.devo.com/#/loxcope/alert/goToQuery?id=\"&incoming_webhook.body[\"alert-id\"]>>",
          "name": "<<incoming_webhook.body.alert_name>>",
          "createdAt": "<<URL_DECODE(parse_alertcontext.message.eventdate)>>",
          "alertId": "<<incoming_webhook.body[\"alert-id\"]>>"
        }
      },
      "reporting": {
        "time_saved_value": 0,
        "time_saved_unit": "minutes"
      },
      "monitoring": {
        "monitor_all_events": false,
        "monitor_failures": false,
        "monitor_no_events_emitted": null
      },
      "template": {
        "created_from_template_guid": null,
        "created_from_template_version": null
      },
      "visuals": {
        "card_icon_image_contents": null,
        "card_icon_image_filename": null,
        "card_icon_name": null
      },
      "width": null,
      "schedule": null
    },
    {
      "type": "Agents::EventTransformationAgent",
      "name": "parse alertcontext",
      "disabled": false,
      "description": null,
      "guid": "9994a28f2f2c4fcb9882e47298198930",
      "origin_story_identifier": "cloud:44e6aef1c1247750fc1a53ae007b2d4c:7033f57391ddd14e63c855c3c2dba8a9",
      "options": {
        "mode": "message_only",
        "loop": false,
        "payload": {
          "message": "=JSON_PARSE(incoming_webhook.body.context)"
        }
      },
      "reporting": {
        "time_saved_value": 0,
        "time_saved_unit": "minutes"
      },
      "monitoring": {
        "monitor_all_events": false,
        "monitor_failures": false,
        "monitor_no_events_emitted": null
      },
      "template": {
        "created_from_template_guid": null,
        "created_from_template_version": null
      },
      "visuals": {
        "card_icon_image_contents": null,
        "card_icon_image_filename": null,
        "card_icon_name": null
      },
      "width": null,
      "schedule": null
    },
    {
      "type": "Agents::HTTPRequestAgent",
      "name": "Gitlab Admin non-gitlab email",
      "disabled": false,
      "description": "",
      "guid": "095dfe616ac30a7d8240e97249d166d2",
      "origin_story_identifier": "cloud:44e6aef1c1247750fc1a53ae007b2d4c:7033f57391ddd14e63c855c3c2dba8a9",
      "options": {
        "url": "https://hooks.slack.com/services/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",
        "content_type": "application_json",
        "method": "post",
        "payload": {
          "blocks": [
            {
              "type": "section",
              "block_id": "metadata",
              "text": {
                "type": "mrkdwn",
                "text": ":siren-siren: User's email <<gitlab_info.body.email>> not found in Slack."
              }
            },
            {
              "type": "section",
              "block_id": "link_id",
              "fields": [
                {
                  "type": "mrkdwn",
                  "text": "*Actor:*\n<<gitlab_info.body.email>>"
                },
                {
                  "type": "mrkdwn",
                  "text": "*Event Time:*\n<<incoming_webhook.body.eventTime>>"
                },
                {
                  "type": "mrkdwn",
                  "text": "*IP Address:*\n<<incoming_webhook.body.srcIp>>"
                },
                {
                  "type": "mrkdwn",
                  "text": "*Link to Query:  *https://eu.devo.com/#/loxcope/alert/goToQuery?id=<<incoming_webhook.body.devo_alert_id>>"
                },
                {
                  "type": "mrkdwn",
                  "text": "*Alert_Name:*  <<incoming_webhook.body.alertName>>"
                }
              ]
            },
            {
              "type": "actions",
              "elements": [
                {
                  "type": "button",
                  "text": {
                    "type": "plain_text",
                    "emoji": true,
                    "text": "Ack Alert"
                  },
                  "style": "danger",
                  "value": "ack_alert"
                },
                {
                  "type": "button",
                  "text": {
                    "type": "plain_text",
                    "emoji": true,
                    "text": "Close Alert"
                  },
                  "style": "primary",
                  "value": "close_alert"
                }
              ]
            },
            {
              "type": "section",
              "text": {
                "type": "mrkdwn",
                "text": "Assign alert to other team member"
              },
              "accessory": {
                "type": "users_select",
                "placeholder": {
                  "type": "plain_text",
                  "text": "Select a user",
                  "emoji": true
                },
                "action_id": "users_select-action"
              }
            },
            {
              "type": "divider"
            }
          ]
        },
        "headers": {}
      },
      "reporting": {
        "time_saved_value": 0,
        "time_saved_unit": "minutes"
      },
      "monitoring": {
        "monitor_all_events": false,
        "monitor_failures": true,
        "monitor_no_events_emitted": null
      },
      "template": {
        "created_from_template_guid": null,
        "created_from_template_version": null
      },
      "visuals": {
        "card_icon_image_contents": null,
        "card_icon_image_filename": null,
        "card_icon_name": null
      },
      "width": null,
      "schedule": null
    },
    {
      "type": "Agents::HTTPRequestAgent",
      "name": "Post to Slack - SIRT Interaction Needed - Devo ballam - Working - Time Testing",
      "disabled": false,
      "description": "",
      "guid": "7a332b962bd27a9c97b2bb20d5e37514",
      "origin_story_identifier": "cloud:44e6aef1c1247750fc1a53ae007b2d4c:7033f57391ddd14e63c855c3c2dba8a9",
      "options": {
        "url": "<<CREDENTIAL.slack_channel_archive_tines_user_unknown_activity>>",
        "content_type": "application_json",
        "method": "post",
        "payload": {
          "blocks": [
            {
              "type": "section",
              "block_id": "metadata",
              "text": {
                "type": "mrkdwn",
                "text": ":alert: User [<<IF(IS_BLANK(parse_incident_information.incident_data.alertContext.actor), parse_incident_information.incident_data.alertContext.userid,parse_incident_information.incident_data.alertContext.actor)>>] confirmed the activity, however they need SIRT assistance"
              }
            },
            {
              "type": "section",
              "block_id": "link_id",
              "fields": [
                {
                  "type": "mrkdwn",
                  "text": "*Actor:*\n<<IF(IS_BLANK(parse_incident_information.incident_data.alertContext.actor), parse_incident_information.incident_data.alertContext.userid,parse_incident_information.incident_data.alertContext.actor)>>"
                },
                {
                  "type": "mrkdwn",
                  "text": "*Event Time:*\n<<parse_incident_information.incident_data.createdAt>>"
                },
                {
                  "type": "mrkdwn",
                  "text": "*IP Address:*\n<<parse_incident_information.incident_data.alertContext.remote_ip>>"
                },
                {
                  "type": "mrkdwn",
                  "text": "*Link to Query:  *<<parse_incident_information.incident_data.link>>"
                },
                {
                  "type": "mrkdwn",
                  "text": "*Alert_Name:*  <<parse_incident_information.incident_data.alertContext.name>>"
                }
              ]
            },
            {
              "type": "actions",
              "elements": [
                {
                  "type": "button",
                  "text": {
                    "type": "plain_text",
                    "emoji": true,
                    "text": "Ack Alert"
                  },
                  "style": "danger",
                  "value": "ack_alert"
                },
                {
                  "type": "button",
                  "text": {
                    "type": "plain_text",
                    "emoji": true,
                    "text": "Close Alert"
                  },
                  "style": "primary",
                  "value": "close_alert"
                }
              ]
            },
            {
              "type": "section",
              "text": {
                "type": "mrkdwn",
                "text": "Assign alert to other team member"
              },
              "accessory": {
                "type": "users_select",
                "placeholder": {
                  "type": "plain_text",
                  "text": "Select a user",
                  "emoji": true
                },
                "action_id": "users_select-action"
              }
            },
            {
              "type": "divider"
            }
          ]
        },
        "headers": {}
      },
      "reporting": {
        "time_saved_value": 0,
        "time_saved_unit": "minutes"
      },
      "monitoring": {
        "monitor_all_events": false,
        "monitor_failures": true,
        "monitor_no_events_emitted": null
      },
      "template": {
        "created_from_template_guid": null,
        "created_from_template_version": null
      },
      "visuals": {
        "card_icon_image_contents": null,
        "card_icon_image_filename": null,
        "card_icon_name": null
      },
      "width": null,
      "schedule": null
    },
    {
      "type": "Agents::TriggerAgent",
      "name": "actor gg",
      "disabled": false,
      "description": null,
      "guid": "cfda1a108af482934ec7d68c8ebf97b4",
      "origin_story_identifier": "cloud:44e6aef1c1247750fc1a53ae007b2d4c:7033f57391ddd14e63c855c3c2dba8a9",
      "options": {
        "rules": [
          {
            "type": "field==value",
            "value": "gg",
            "path": "<<parse_alertcontext.message.meta_user>>"
          }
        ]
      },
      "reporting": {
        "time_saved_value": 0,
        "time_saved_unit": "minutes"
      },
      "monitoring": {
        "monitor_all_events": false,
        "monitor_failures": false,
        "monitor_no_events_emitted": null
      },
      "template": {
        "created_from_template_guid": null,
        "created_from_template_version": null
      },
      "visuals": {
        "card_icon_image_contents": null,
        "card_icon_image_filename": null,
        "card_icon_name": null
      },
      "width": null
    },
    {
      "type": "Agents::TriggerAgent",
      "name": "actor generic",
      "disabled": false,
      "description": null,
      "guid": "e82b60b29736918281ecfe9faa82d10c",
      "origin_story_identifier": "cloud:44e6aef1c1247750fc1a53ae007b2d4c:7033f57391ddd14e63c855c3c2dba8a9",
      "options": {
        "rules": [
          {
            "type": "field!=value",
            "value": "root",
            "path": "<<parse_alertcontext.message.meta_user>>"
          }
        ]
      },
      "reporting": {
        "time_saved_value": 0,
        "time_saved_unit": "minutes"
      },
      "monitoring": {
        "monitor_all_events": false,
        "monitor_failures": false,
        "monitor_no_events_emitted": null
      },
      "template": {
        "created_from_template_guid": null,
        "created_from_template_version": null
      },
      "visuals": {
        "card_icon_image_contents": null,
        "card_icon_image_filename": null,
        "card_icon_name": null
      },
      "width": null
    },
    {
      "type": "Agents::EventTransformationAgent",
      "name": "email",
      "disabled": false,
      "description": null,
      "guid": "e492005faf4fc619832f8daacf96117f",
      "origin_story_identifier": "cloud:f10fe9bf2bc3942d032754e35b3b201b:10e88b14bafc22a7bbbfacce667460d3",
      "options": {
        "mode": "message_only",
        "loop": false,
        "payload": {
          "email": "hsharma@gitlab.com"
        }
      },
      "reporting": {
        "time_saved_value": 0,
        "time_saved_unit": "minutes"
      },
      "monitoring": {
        "monitor_all_events": false,
        "monitor_failures": false,
        "monitor_no_events_emitted": null
      },
      "template": {
        "created_from_template_guid": null,
        "created_from_template_version": null
      },
      "visuals": {
        "card_icon_image_contents": null,
        "card_icon_image_filename": null,
        "card_icon_name": null
      },
      "width": null,
      "schedule": null
    },
    {
      "type": "Agents::EventTransformationAgent",
      "name": "email",
      "disabled": false,
      "description": null,
      "guid": "af522e88fb4e4af6b7c0987b7bf7a055",
      "origin_story_identifier": "cloud:f10fe9bf2bc3942d032754e35b3b201b:10e88b14bafc22a7bbbfacce667460d3",
      "options": {
        "mode": "message_only",
        "loop": false,
        "payload": {
          "email": "vmairet@gitlab.com"
        }
      },
      "reporting": {
        "time_saved_value": 0,
        "time_saved_unit": "minutes"
      },
      "monitoring": {
        "monitor_all_events": false,
        "monitor_failures": false,
        "monitor_no_events_emitted": null
      },
      "template": {
        "created_from_template_guid": null,
        "created_from_template_version": null
      },
      "visuals": {
        "card_icon_image_contents": null,
        "card_icon_image_filename": null,
        "card_icon_name": null
      },
      "width": null,
      "schedule": null
    },
    {
      "type": "Agents::HTTPRequestAgent",
      "name": "Search User by Email in Slack",
      "disabled": false,
      "description": null,
      "guid": "2c2d6bf45f948d6ec78cf90b2af8cd2a",
      "origin_story_identifier": "cloud:44e6aef1c1247750fc1a53ae007b2d4c:7033f57391ddd14e63c855c3c2dba8a9",
      "options": {
        "url": "https://slack.com/api/users.lookupByEmail",
        "content_type": "application/json",
        "method": "get",
        "payload": {
          "email": "<<email.email>>"
        },
        "headers": {
          "Authorization": "Bearer xoxb-5579698652850-5796826668944-O5JAwEHoYdE3NOfBsLO2F8iV"
        }
      },
      "reporting": {
        "time_saved_value": 0,
        "time_saved_unit": "minutes"
      },
      "monitoring": {
        "monitor_all_events": false,
        "monitor_failures": false,
        "monitor_no_events_emitted": null
      },
      "template": {
        "created_from_template_guid": null,
        "created_from_template_version": null
      },
      "visuals": {
        "card_icon_image_contents": null,
        "card_icon_image_filename": null,
        "card_icon_name": null
      },
      "width": null,
      "schedule": null
    }
  ],
  "diagram_notes": [],
  "links": [
    {
      "source": 0,
      "receiver": 11
    },
    {
      "source": 1,
      "receiver": 2
    },
    {
      "source": 2,
      "receiver": 4
    },
    {
      "source": 2,
      "receiver": 7
    },
    {
      "source": 3,
      "receiver": 5
    },
    {
      "source": 3,
      "receiver": 8
    },
    {
      "source": 4,
      "receiver": 9
    },
    {
      "source": 5,
      "receiver": 10
    },
    {
      "source": 7,
      "receiver": 15
    },
    {
      "source": 9,
      "receiver": 16
    },
    {
      "source": 10,
      "receiver": 6
    },
    {
      "source": 11,
      "receiver": 12
    },
    {
      "source": 11,
      "receiver": 19
    },
    {
      "source": 12,
      "receiver": 20
    },
    {
      "source": 14,
      "receiver": 3
    },
    {
      "source": 15,
      "receiver": 14
    },
    {
      "source": 18,
      "receiver": 21
    },
    {
      "source": 19,
      "receiver": 1
    },
    {
      "source": 20,
      "receiver": 22
    },
    {
      "source": 21,
      "receiver": 2
    },
    {
      "source": 22,
      "receiver": 7
    }
  ],
  "diagram_layout": "{\"e8576e7ee35161792c82f96d2d7b2ebe\":[360,-1515],\"7a4410016f29d0f0a59a54b577406aac\":[210,-1275],\"b78b2f045cd908510cfa7452ee90ba15\":[-90,-1110],\"ba9c9024cb07787f0035a74e430c959c\":[30,-585],\"8f53cb167cc956df3fd12acdefd35acc\":[-270,-915],\"c67fe198b216335e7e158e08d8c19884\":[-120,-405],\"91bd34fab52493b24342650a6cac312b\":[15,-165],\"22bdbd522ca3d1bd5a046d91b58ccf45\":[90,-915],\"4c1c2b6b67557586af2ff5021383a20b\":[240,-405],\"e92010ba2fdcbc0e3023951365515cc6\":[-270,-825],\"81847e61b9fa2cb141701f68108d34c5\":[15,-240],\"d41a3b61f3df1c8aa91d8d20bc2d5bcf\":[360,-1440],\"ae1c8cb1dadd2eb0f5eefeeb4948d2f8\":[-195,-1350],\"2dd13a2445eb31e1b3fadab7d6c33709\":[825,-570],\"a29b5fe1ff6657f9df37faa7f81dced5\":[30,-675],\"9994a28f2f2c4fcb9882e47298198930\":[45,-765],\"095dfe616ac30a7d8240e97249d166d2\":[-270,-720],\"7a332b962bd27a9c97b2bb20d5e37514\":[1185,-645],\"cfda1a108af482934ec7d68c8ebf97b4\":[45,-1350],\"e82b60b29736918281ecfe9faa82d10c\":[360,-1350],\"e492005faf4fc619832f8daacf96117f\":[-210,-1275],\"af522e88fb4e4af6b7c0987b7bf7a055\":[15,-1275],\"2c2d6bf45f948d6ec78cf90b2af8cd2a\":[-390,-1140]}",
  "send_to_story_enabled": true,
  "entry_agent_guid": "e8576e7ee35161792c82f96d2d7b2ebe",
  "exit_agent_guids": [
    "4c1c2b6b67557586af2ff5021383a20b"
  ],
  "exit_agent_guid": "4c1c2b6b67557586af2ff5021383a20b",
  "api_entry_action_guids": [],
  "api_exit_action_guids": [],
  "keep_events_for": 604800,
  "reporting_status": true,
  "send_to_story_access": "team",
  "story_library_metadata": {},
  "monitor_failures": false,
  "send_to_stories": [],
  "form": null,
  "synchronous_webhooks_enabled": false,
  "forms": [],
  "pages": [],
  "tags": [],
  "time_saved_unit": "minutes",
  "time_saved_value": 0,
  "origin_story_identifier": "cloud:44e6aef1c1247750fc1a53ae007b2d4c:7033f57391ddd14e63c855c3c2dba8a9",
  "integration_product": null,
  "integration_vendor": null,
  "exported_at": "2023-11-28T12:39:24Z",
  "icon": ":+1:",
  "integrations": []
}