{
  "schema_version": 18,
  "standard_lib_version": 40,
  "action_runtime_version": 5,
  "name": "Handogotchi",
  "description": null,
  "guid": "12e3eeb740d3045e3eab7be7263ccd80",
  "slug": "handogotchi",
  "agents": [
    {
      "type": "Agents::HTTPRequestAgent",
      "name": "Post Message to IR Channel",
      "disabled": false,
      "description": null,
      "guid": "f56594bb09455a9bbfe28fb4674044dd",
      "origin_story_identifier": "cloud:44e6aef1c1247750fc1a53ae007b2d4c:f8cd1e78465cefe576ca3212e6958674",
      "options": {
        "url": "https://slack.com/api/chat.postMessage",
        "content_type": "application_json",
        "method": "post",
        "payload": {
          "channel": "C05NEA38X46",
          "attachments": [
            {
              "blocks": [
                {
                  "type": "header",
                  "text": {
                    "type": "plain_text",
                    "text": "( ╯°▽°)╯ Handover",
                    "emoji": true
                  }
                },
                {
                  "type": "section",
                  "text": {
                    "type": "plain_text",
                    "text": "Hello team! It's time for the handover! :handshake:",
                    "emoji": true
                  }
                },
                {
                  "type": "input",
                  "element": {
                    "type": "plain_text_input",
                    "multiline": true,
                    "action_id": "handoff-text"
                  },
                  "label": {
                    "type": "plain_text",
                    "text": "Is there any work required to continue? Are there any high-severity/high-priority incidents where the investigation or mitigation process phase is still ongoing? Write a detailed handover message below so that the next SIRT engineer on-call can pick up from where you left off.",
                    "emoji": true
                  }
                },
                {
                  "type": "input",
                  "element": {
                    "type": "plain_text_input",
                    "multiline": true,
                    "action_id": "handoff-info"
                  },
                  "label": {
                    "type": "plain_text",
                    "text": "Do you have any additional information about lower-severity incidents that could be relevant in case of escalation? Notify the team below. You still retain ownership of this incident but, as long as it doesn't escalate, it can wait for the next business day.",
                    "emoji": true
                  }
                },
                {
                  "type": "actions",
                  "elements": [
                    {
                      "type": "button",
                      "text": {
                        "type": "plain_text",
                        "text": "Send",
                        "emoji": true
                      },
                      "value": "send-handoff",
                      "action_id": "send-hand0"
                    }
                  ]
                }
              ]
            }
          ]
        },
        "headers": {
          "Authorization": "Bearer <<CREDENTIAL.hando_s_slack_token>>"
        }
      },
      "reporting": {
        "time_saved_value": 0,
        "time_saved_unit": "minutes"
      },
      "monitoring": {
        "monitor_all_events": false,
        "monitor_failures": false,
        "monitor_no_events_emitted": null
      },
      "template": {
        "created_from_template_guid": null,
        "created_from_template_version": null
      },
      "visuals": {
        "card_icon_image_contents": null,
        "card_icon_image_filename": null,
        "card_icon_name": null
      },
      "width": null,
      "schedule": null
    },
    {
      "type": "Agents::WebhookAgent",
      "name": "Gotchi Actions",
      "disabled": false,
      "description": null,
      "guid": "78409ee1354886be98759c34fb8f19d8",
      "origin_story_identifier": "cloud:44e6aef1c1247750fc1a53ae007b2d4c:f8cd1e78465cefe576ca3212e6958674",
      "options": {
        "secret": "1dbcb82b9322983b73c492978386b65a",
        "response": "",
        "path": "0387345275f20e1350d1ba6ce34c7a46"
      },
      "reporting": {
        "time_saved_value": 0,
        "time_saved_unit": "minutes"
      },
      "monitoring": {
        "monitor_all_events": false,
        "monitor_failures": false,
        "monitor_no_events_emitted": null
      },
      "template": {
        "created_from_template_guid": null,
        "created_from_template_version": null
      },
      "visuals": {
        "card_icon_image_contents": null,
        "card_icon_image_filename": null,
        "card_icon_name": null
      },
      "width": null
    },
    {
      "type": "Agents::EventTransformationAgent",
      "name": "Extract Action",
      "disabled": false,
      "description": null,
      "guid": "911e33e2e5e0f6aa7fdc17727d49ee70",
      "origin_story_identifier": "cloud:44e6aef1c1247750fc1a53ae007b2d4c:f8cd1e78465cefe576ca3212e6958674",
      "options": {
        "mode": "message_only",
        "payload": {
          "message": "=JSON_PARSE(gotchi_actions.body.payload)"
        }
      },
      "reporting": {
        "time_saved_value": 0,
        "time_saved_unit": "minutes"
      },
      "monitoring": {
        "monitor_all_events": false,
        "monitor_failures": false,
        "monitor_no_events_emitted": null
      },
      "template": {
        "created_from_template_guid": null,
        "created_from_template_version": null
      },
      "visuals": {
        "card_icon_image_contents": null,
        "card_icon_image_filename": null,
        "card_icon_name": null
      },
      "width": null,
      "schedule": null
    },
    {
      "type": "Agents::TriggerAgent",
      "name": "Feed",
      "disabled": false,
      "description": null,
      "guid": "7c0171e062fa20e13e7f314c02817a7c",
      "origin_story_identifier": "cloud:44e6aef1c1247750fc1a53ae007b2d4c:f8cd1e78465cefe576ca3212e6958674",
      "options": {
        "rules": [
          {
            "type": "field==value",
            "value": "feed",
            "path": "<<extract_action.message.actions.first.value>>"
          }
        ]
      },
      "reporting": {
        "time_saved_value": 0,
        "time_saved_unit": "minutes"
      },
      "monitoring": {
        "monitor_all_events": false,
        "monitor_failures": false,
        "monitor_no_events_emitted": null
      },
      "template": {
        "created_from_template_guid": null,
        "created_from_template_version": null
      },
      "visuals": {
        "card_icon_image_contents": null,
        "card_icon_image_filename": null,
        "card_icon_name": null
      },
      "width": null
    },
    {
      "type": "Agents::TriggerAgent",
      "name": "Pet",
      "disabled": false,
      "description": null,
      "guid": "c8cce34723f25349ab05284f42cea772",
      "origin_story_identifier": "cloud:44e6aef1c1247750fc1a53ae007b2d4c:f8cd1e78465cefe576ca3212e6958674",
      "options": {
        "rules": [
          {
            "type": "field==value",
            "value": "pet",
            "path": "<<extract_action.message.actions.first.value>>"
          }
        ]
      },
      "reporting": {
        "time_saved_value": 0,
        "time_saved_unit": "minutes"
      },
      "monitoring": {
        "monitor_all_events": false,
        "monitor_failures": false,
        "monitor_no_events_emitted": null
      },
      "template": {
        "created_from_template_guid": null,
        "created_from_template_version": null
      },
      "visuals": {
        "card_icon_image_contents": null,
        "card_icon_image_filename": null,
        "card_icon_name": null
      },
      "width": null
    },
    {
      "type": "Agents::HTTPRequestAgent",
      "name": "Respond with Happy Gotchi",
      "disabled": false,
      "description": null,
      "guid": "12024dd302b0c48dca74fc5134dbd41e",
      "origin_story_identifier": "cloud:44e6aef1c1247750fc1a53ae007b2d4c:f8cd1e78465cefe576ca3212e6958674",
      "options": {
        "url": "<<extract_action.message.response_url>>",
        "content_type": "json",
        "method": "post",
        "payload": {
          "text": "( /^▽^)/ Yay! Hando got some attention. You can check the latest handover <http://34.66.143.75/gitlab-instance-2105a4c2/security-incident-response-team/handovers/-/issues | here>."
        }
      },
      "reporting": {
        "time_saved_value": 0,
        "time_saved_unit": "minutes"
      },
      "monitoring": {
        "monitor_all_events": false,
        "monitor_failures": false,
        "monitor_no_events_emitted": null
      },
      "template": {
        "created_from_template_guid": null,
        "created_from_template_version": null
      },
      "visuals": {
        "card_icon_image_contents": null,
        "card_icon_image_filename": null,
        "card_icon_name": null
      },
      "width": null,
      "schedule": null
    },
    {
      "type": "Agents::HTTPRequestAgent",
      "name": "Respond with Love Gotchi",
      "disabled": false,
      "description": null,
      "guid": "0d907a2443bfcb4a744f041732ef2783",
      "origin_story_identifier": "cloud:44e6aef1c1247750fc1a53ae007b2d4c:f8cd1e78465cefe576ca3212e6958674",
      "options": {
        "url": "<<extract_action.message.response_url>>",
        "content_type": "json",
        "method": "post",
        "payload": {
          "text": "( ♥▽♥) <<extract_action.message.user.username>> petted Hando. The rest can find the handover <http://34.66.143.75/gitlab-instance-2105a4c2/security-incident-response-team/handovers/-/issues | here>."
        }
      },
      "reporting": {
        "time_saved_value": 0,
        "time_saved_unit": "minutes"
      },
      "monitoring": {
        "monitor_all_events": false,
        "monitor_failures": false,
        "monitor_no_events_emitted": null
      },
      "template": {
        "created_from_template_guid": null,
        "created_from_template_version": null
      },
      "visuals": {
        "card_icon_image_contents": null,
        "card_icon_image_filename": null,
        "card_icon_name": null
      },
      "width": null,
      "schedule": null
    },
    {
      "type": "Agents::HTTPRequestAgent",
      "name": "Get Fun Fact",
      "disabled": false,
      "description": null,
      "guid": "7d86622ae0cbb239993f371d0caa835f",
      "origin_story_identifier": "cloud:44e6aef1c1247750fc1a53ae007b2d4c:f8cd1e78465cefe576ca3212e6958674",
      "options": {
        "url": "https://uselessfacts.jsph.pl/random.json?language=en",
        "method": "get"
      },
      "reporting": {
        "time_saved_value": 0,
        "time_saved_unit": "minutes"
      },
      "monitoring": {
        "monitor_all_events": false,
        "monitor_failures": false,
        "monitor_no_events_emitted": null
      },
      "template": {
        "created_from_template_guid": null,
        "created_from_template_version": null
      },
      "visuals": {
        "card_icon_image_contents": null,
        "card_icon_image_filename": null,
        "card_icon_name": null
      },
      "width": null,
      "schedule": null
    },
    {
      "type": "Agents::EventTransformationAgent",
      "name": "Extract Fun Fact",
      "disabled": false,
      "description": null,
      "guid": "dfa5fbf726a2293c280dc90c765f0c6b",
      "origin_story_identifier": "cloud:44e6aef1c1247750fc1a53ae007b2d4c:f8cd1e78465cefe576ca3212e6958674",
      "options": {
        "mode": "message_only",
        "loop": false,
        "payload": {
          "fact": "<<get_fun_fact.body.text>>"
        }
      },
      "reporting": {
        "time_saved_value": 0,
        "time_saved_unit": "minutes"
      },
      "monitoring": {
        "monitor_all_events": false,
        "monitor_failures": false,
        "monitor_no_events_emitted": null
      },
      "template": {
        "created_from_template_guid": null,
        "created_from_template_version": null
      },
      "visuals": {
        "card_icon_image_contents": null,
        "card_icon_image_filename": null,
        "card_icon_name": null
      },
      "width": null,
      "schedule": null
    },
    {
      "type": "Agents::TriggerAgent",
      "name": "Fact",
      "disabled": false,
      "description": null,
      "guid": "38e7095c5d4e855697a73c5bfeba7a86",
      "origin_story_identifier": "cloud:44e6aef1c1247750fc1a53ae007b2d4c:f8cd1e78465cefe576ca3212e6958674",
      "options": {
        "rules": [
          {
            "type": "field==value",
            "value": "fact",
            "path": "<<extract_action.message.actions.first.value>>"
          }
        ]
      },
      "reporting": {
        "time_saved_value": 0,
        "time_saved_unit": "minutes"
      },
      "monitoring": {
        "monitor_all_events": false,
        "monitor_failures": false,
        "monitor_no_events_emitted": null
      },
      "template": {
        "created_from_template_guid": null,
        "created_from_template_version": null
      },
      "visuals": {
        "card_icon_image_contents": null,
        "card_icon_image_filename": null,
        "card_icon_name": null
      },
      "width": null
    },
    {
      "type": "Agents::HTTPRequestAgent",
      "name": "Respond with Fact Gotchi",
      "disabled": false,
      "description": null,
      "guid": "633514be86e33b1437bd10eccc91d77f",
      "origin_story_identifier": "cloud:44e6aef1c1247750fc1a53ae007b2d4c:f8cd1e78465cefe576ca3212e6958674",
      "options": {
        "url": "<<extract_action.message.response_url>>",
        "content_type": "json",
        "method": "post",
        "payload": {
          "text": "( ╯°▽°)╯ Did you know? <<extract_fun_fact.fact>>"
        }
      },
      "reporting": {
        "time_saved_value": 0,
        "time_saved_unit": "minutes"
      },
      "monitoring": {
        "monitor_all_events": false,
        "monitor_failures": false,
        "monitor_no_events_emitted": null
      },
      "template": {
        "created_from_template_guid": null,
        "created_from_template_version": null
      },
      "visuals": {
        "card_icon_image_contents": null,
        "card_icon_image_filename": null,
        "card_icon_name": null
      },
      "width": null,
      "schedule": null
    },
    {
      "type": "Agents::TriggerAgent",
      "name": "Handoff",
      "disabled": false,
      "description": null,
      "guid": "2fc043a5db331e161d2d3fb104556ee2",
      "origin_story_identifier": "cloud:44e6aef1c1247750fc1a53ae007b2d4c:f8cd1e78465cefe576ca3212e6958674",
      "options": {
        "rules": [
          {
            "type": "field==value",
            "value": "send-handoff",
            "path": "<<extract_action.message.actions.first.value>>"
          }
        ]
      },
      "reporting": {
        "time_saved_value": 0,
        "time_saved_unit": "minutes"
      },
      "monitoring": {
        "monitor_all_events": false,
        "monitor_failures": false,
        "monitor_no_events_emitted": null
      },
      "template": {
        "created_from_template_guid": null,
        "created_from_template_version": null
      },
      "visuals": {
        "card_icon_image_contents": null,
        "card_icon_image_filename": null,
        "card_icon_name": null
      },
      "width": null
    },
    {
      "type": "Agents::TriggerAgent",
      "name": "Not empty",
      "disabled": false,
      "description": null,
      "guid": "e904d280d1a86987214d519b6da9e025",
      "origin_story_identifier": "cloud:44e6aef1c1247750fc1a53ae007b2d4c:f8cd1e78465cefe576ca3212e6958674",
      "options": {
        "rules": [
          {
            "type": "field>value",
            "value": "0",
            "path": "<<SIZE(extract_handoff.handoff)>>"
          },
          {
            "type": "field>value",
            "value": "0",
            "path": "<<SIZE(extract_handoff.fyi)>>"
          }
        ]
      },
      "reporting": {
        "time_saved_value": 0,
        "time_saved_unit": "minutes"
      },
      "monitoring": {
        "monitor_all_events": false,
        "monitor_failures": false,
        "monitor_no_events_emitted": null
      },
      "template": {
        "created_from_template_guid": null,
        "created_from_template_version": null
      },
      "visuals": {
        "card_icon_image_contents": null,
        "card_icon_image_filename": null,
        "card_icon_name": null
      },
      "width": null
    },
    {
      "type": "Agents::EventTransformationAgent",
      "name": "Extract Handoff",
      "disabled": false,
      "description": null,
      "guid": "5d0d3385a8f99ddada82764f6d9d8837",
      "origin_story_identifier": "cloud:44e6aef1c1247750fc1a53ae007b2d4c:f8cd1e78465cefe576ca3212e6958674",
      "options": {
        "mode": "message_only",
        "loop": false,
        "payload": {
          "handoff": "<<JSONPATH(JSON_PARSE(gotchi_actions.body.payload).state.values, \"*.handoff-text.value\") |> JOIN(%)>>",
          "fyi": "<<JSONPATH(JSON_PARSE(gotchi_actions.body.payload).state.values, \"*.handoff-info.value\") |> JOIN(%)>>"
        }
      },
      "reporting": {
        "time_saved_value": 0,
        "time_saved_unit": "minutes"
      },
      "monitoring": {
        "monitor_all_events": false,
        "monitor_failures": false,
        "monitor_no_events_emitted": null
      },
      "template": {
        "created_from_template_guid": null,
        "created_from_template_version": null
      },
      "visuals": {
        "card_icon_image_contents": null,
        "card_icon_image_filename": null,
        "card_icon_name": null
      },
      "width": null,
      "schedule": null
    },
    {
      "type": "Agents::HTTPRequestAgent",
      "name": "Confirm Handoff Receipt",
      "disabled": false,
      "description": null,
      "guid": "2f9f2e1f867c8b357ff11e9f8a34a8cf",
      "origin_story_identifier": "cloud:44e6aef1c1247750fc1a53ae007b2d4c:f8cd1e78465cefe576ca3212e6958674",
      "options": {
        "url": "<<extract_action.message.response_url>>",
        "content_type": "json",
        "method": "post",
        "payload": {
          "text": "( ╯°▽°)╯ Thanks for the handoff update. It's been forwarded to the team. They all highly appreciate your work ♥"
        }
      },
      "reporting": {
        "time_saved_value": 0,
        "time_saved_unit": "minutes"
      },
      "monitoring": {
        "monitor_all_events": false,
        "monitor_failures": false,
        "monitor_no_events_emitted": null
      },
      "template": {
        "created_from_template_guid": null,
        "created_from_template_version": null
      },
      "visuals": {
        "card_icon_image_contents": null,
        "card_icon_image_filename": null,
        "card_icon_name": null
      },
      "width": null,
      "schedule": null
    },
    {
      "type": "Agents::HTTPRequestAgent",
      "name": "Forward Handoff",
      "disabled": false,
      "description": null,
      "guid": "c8f84b70c3ee5790b924b14e7bd3ced2",
      "origin_story_identifier": "cloud:44e6aef1c1247750fc1a53ae007b2d4c:f8cd1e78465cefe576ca3212e6958674",
      "options": {
        "url": "<<RESOURCE.slack_response_channel_hook>>",
        "content_type": "json",
        "method": "post",
        "payload": {
          "text": "<<make_gitlab_issue_description.message>>"
        }
      },
      "reporting": {
        "time_saved_value": 0,
        "time_saved_unit": "minutes"
      },
      "monitoring": {
        "monitor_all_events": false,
        "monitor_failures": false,
        "monitor_no_events_emitted": null
      },
      "template": {
        "created_from_template_guid": null,
        "created_from_template_version": null
      },
      "visuals": {
        "card_icon_image_contents": null,
        "card_icon_image_filename": null,
        "card_icon_name": null
      },
      "width": null,
      "schedule": null
    },
    {
      "type": "Agents::HTTPRequestAgent",
      "name": "Create GitLab Handover Issue",
      "disabled": false,
      "description": null,
      "guid": "92cce79a65d1bd5ea026a200f59b1cef",
      "origin_story_identifier": "cloud:44e6aef1c1247750fc1a53ae007b2d4c:f8cd1e78465cefe576ca3212e6958674",
      "options": {
        "url": "<<RESOURCE.blacklab_api_url>>/projects/8/issues",
        "method": "post",
        "headers": {
          "PRIVATE-TOKEN": "<<CREDENTIAL.hando_s_token>>"
        },
        "payload": {
          "title": "Handoff <<DATE(\"now\", \"%Y-%m-%d\")>> by <<get_user_profile.body.profile.real_name>>",
          "description": "<<make_gitlab_issue_description.comment>>"
        }
      },
      "reporting": {
        "time_saved_value": 0,
        "time_saved_unit": "minutes"
      },
      "monitoring": {
        "monitor_all_events": false,
        "monitor_failures": false,
        "monitor_no_events_emitted": null
      },
      "template": {
        "created_from_template_guid": null,
        "created_from_template_version": null
      },
      "visuals": {
        "card_icon_image_contents": null,
        "card_icon_image_filename": null,
        "card_icon_name": null
      },
      "width": null,
      "schedule": []
    },
    {
      "type": "Agents::EventTransformationAgent",
      "name": "Make GitLab Issue Description",
      "disabled": false,
      "description": null,
      "guid": "c0d2e159d3a524623442599f506ec62c",
      "origin_story_identifier": "cloud:44e6aef1c1247750fc1a53ae007b2d4c:f8cd1e78465cefe576ca3212e6958674",
      "options": {
        "mode": "message_only",
        "loop": false,
        "payload": {
          "comment": "# ( ╯°▽°)╯\n\n## Work required to continue\n<<extract_handoff.handoff>>\n\n## Additional information\n <<extract_handoff.fyi>>",
          "message": "( ╯°▽°)╯ Hando has the warm handoff ready for the team: :handshake:\n\nHandoff <<DATE(\"now\", \"%Y-%m-%d\")>>\nby <<get_user_profile.body.profile.real_name>>\n\nWork required to continue:\n<<extract_handoff.handoff>>\n\nAdditional information\n <<extract_handoff.fyi>>"
        }
      },
      "reporting": {
        "time_saved_value": 0,
        "time_saved_unit": "minutes"
      },
      "monitoring": {
        "monitor_all_events": false,
        "monitor_failures": false,
        "monitor_no_events_emitted": null
      },
      "template": {
        "created_from_template_guid": null,
        "created_from_template_version": null
      },
      "visuals": {
        "card_icon_image_contents": null,
        "card_icon_image_filename": null,
        "card_icon_name": null
      },
      "width": null,
      "schedule": null
    },
    {
      "type": "Agents::HTTPRequestAgent",
      "name": "Send Hando Actions",
      "disabled": false,
      "description": null,
      "guid": "b01da6f1d35a525cbd8861dc0f3c3304",
      "origin_story_identifier": "cloud:44e6aef1c1247750fc1a53ae007b2d4c:f8cd1e78465cefe576ca3212e6958674",
      "options": {
        "url": "<<RESOURCE.slack_response_channel_hook>>",
        "content_type": "json",
        "method": "post",
        "payload": {
          "blocks": [
            {
              "type": "actions",
              "elements": [
                {
                  "type": "button",
                  "text": {
                    "type": "plain_text",
                    "emoji": true,
                    "text": "Feed"
                  },
                  "value": "feed"
                },
                {
                  "type": "button",
                  "text": {
                    "type": "plain_text",
                    "emoji": true,
                    "text": "Pet"
                  },
                  "value": "pet"
                },
                {
                  "type": "button",
                  "text": {
                    "type": "plain_text",
                    "emoji": true,
                    "text": "Give us a fun fact!"
                  },
                  "value": "fact"
                }
              ]
            }
          ]
        }
      },
      "reporting": {
        "time_saved_value": 0,
        "time_saved_unit": "minutes"
      },
      "monitoring": {
        "monitor_all_events": false,
        "monitor_failures": false,
        "monitor_no_events_emitted": null
      },
      "template": {
        "created_from_template_guid": null,
        "created_from_template_version": null
      },
      "visuals": {
        "card_icon_image_contents": null,
        "card_icon_image_filename": null,
        "card_icon_name": null
      },
      "width": null,
      "schedule": null
    },
    {
      "type": "Agents::HTTPRequestAgent",
      "name": "Get User Profile",
      "disabled": false,
      "description": null,
      "guid": "7ed94b46cef3256e7d24508bbd9201af",
      "origin_story_identifier": "cloud:f10fe9bf2bc3942d032754e35b3b201b:12e3eeb740d3045e3eab7be7263ccd80",
      "options": {
        "url": "https://slack.com/api/users.profile.get",
        "method": "get",
        "payload": {
          "user": "<<extract_action.message.user.id>>"
        },
        "content_type": "application/x-www-form-urlencoded",
        "headers": {
          "Authorization": "Bearer <<CREDENTIAL.hando_s_slack_token>>"
        }
      },
      "reporting": {
        "time_saved_value": 0,
        "time_saved_unit": "minutes"
      },
      "monitoring": {
        "monitor_all_events": false,
        "monitor_failures": false,
        "monitor_no_events_emitted": null
      },
      "template": {
        "created_from_template_guid": null,
        "created_from_template_version": null
      },
      "visuals": {
        "card_icon_image_contents": null,
        "card_icon_image_filename": null,
        "card_icon_name": null
      },
      "width": null,
      "schedule": null
    },
    {
      "type": "Agents::HTTPRequestAgent",
      "name": "Send Feedback Form",
      "disabled": false,
      "description": null,
      "guid": "2453feab937b43dae2cf79dfe3bf2716",
      "origin_story_identifier": "cloud:44e6aef1c1247750fc1a53ae007b2d4c:f8cd1e78465cefe576ca3212e6958674",
      "options": {
        "url": "https://slack.com/api/chat.postMessage",
        "content_type": "application_json",
        "method": "post",
        "payload": {
          "channel": "C05GYNNUEUV",
          "attachments": [
            {
              "blocks": [
                {
                  "type": "header",
                  "text": {
                    "type": "plain_text",
                    "text": "( ╯°▽°)╯ Feedback Form",
                    "emoji": true
                  }
                },
                {
                  "type": "section",
                  "text": {
                    "type": "plain_text",
                    "text": "Hey, the workshop is over. We hope you thoroughly enjoyed it. Any feedback is welcome. Be as honest as you can so we can make this session even more awesome next time!",
                    "emoji": true
                  }
                },
                {
                  "type": "input",
                  "element": {
                    "type": "plain_text_input",
                    "multiline": true,
                    "action_id": "feedback-pos"
                  },
                  "label": {
                    "type": "plain_text",
                    "text": "What did you like?",
                    "emoji": true
                  }
                },
                {
                  "type": "input",
                  "element": {
                    "type": "plain_text_input",
                    "multiline": true,
                    "action_id": "feedback-neg"
                  },
                  "label": {
                    "type": "plain_text",
                    "text": "What can we improve?",
                    "emoji": true
                  }
                },
                {
                  "type": "input",
                  "element": {
                    "type": "radio_buttons",
                    "options": [
                      {
                        "text": {
                          "type": "plain_text",
                          "text": ":star-struck:",
                          "emoji": true
                        },
                        "value": "value-5"
                      },
                      {
                        "text": {
                          "type": "plain_text",
                          "text": ":smile:",
                          "emoji": true
                        },
                        "value": "value-4"
                      },
                      {
                        "text": {
                          "type": "plain_text",
                          "text": ":slightly_smiling_face:",
                          "emoji": true
                        },
                        "value": "value-3"
                      },
                      {
                        "text": {
                          "type": "plain_text",
                          "text": ":neutral_face:",
                          "emoji": true
                        },
                        "value": "value-2"
                      },
                      {
                        "text": {
                          "type": "plain_text",
                          "text": ":white_frowning_face:",
                          "emoji": true
                        },
                        "value": "value-1"
                      },
                      {
                        "text": {
                          "type": "plain_text",
                          "text": ":angry:",
                          "emoji": true
                        },
                        "value": "value-0"
                      }
                    ],
                    "action_id": "feedback-rating"
                  },
                  "label": {
                    "type": "plain_text",
                    "text": "How do you feel after this workshop?",
                    "emoji": true
                  }
                },
                {
                  "type": "actions",
                  "elements": [
                    {
                      "type": "button",
                      "text": {
                        "type": "plain_text",
                        "text": "Send",
                        "emoji": true
                      },
                      "value": "send-feedback",
                      "action_id": "send-feed"
                    }
                  ]
                }
              ]
            }
          ]
        },
        "headers": {
          "Authorization": "Bearer <<CREDENTIAL.hando_s_slack_token>>"
        }
      },
      "reporting": {
        "time_saved_value": 0,
        "time_saved_unit": "minutes"
      },
      "monitoring": {
        "monitor_all_events": false,
        "monitor_failures": false,
        "monitor_no_events_emitted": null
      },
      "template": {
        "created_from_template_guid": null,
        "created_from_template_version": null
      },
      "visuals": {
        "card_icon_image_contents": null,
        "card_icon_image_filename": null,
        "card_icon_name": null
      },
      "width": null,
      "schedule": [
        {
          "cron": "50 15 * * 4",
          "timezone": "Asia/Bangkok"
        }
      ]
    },
    {
      "type": "Agents::TriggerAgent",
      "name": "Feedback",
      "disabled": false,
      "description": null,
      "guid": "738496c615121dbcd1a3d0f51d77bff0",
      "origin_story_identifier": "cloud:44e6aef1c1247750fc1a53ae007b2d4c:f8cd1e78465cefe576ca3212e6958674",
      "options": {
        "rules": [
          {
            "type": "field==value",
            "value": "send-feedback",
            "path": "<<extract_action.message.actions.first.value>>"
          }
        ]
      },
      "reporting": {
        "time_saved_value": 0,
        "time_saved_unit": "minutes"
      },
      "monitoring": {
        "monitor_all_events": false,
        "monitor_failures": false,
        "monitor_no_events_emitted": null
      },
      "template": {
        "created_from_template_guid": null,
        "created_from_template_version": null
      },
      "visuals": {
        "card_icon_image_contents": null,
        "card_icon_image_filename": null,
        "card_icon_name": null
      },
      "width": null
    },
    {
      "type": "Agents::HTTPRequestAgent",
      "name": "Send Feedback Form",
      "disabled": false,
      "description": null,
      "guid": "2e930cf3b36c069a9aee848bb4f7b56a",
      "origin_story_identifier": "cloud:44e6aef1c1247750fc1a53ae007b2d4c:f8cd1e78465cefe576ca3212e6958674",
      "options": {
        "url": "https://slack.com/api/chat.postMessage",
        "content_type": "application_json",
        "method": "post",
        "payload": {
          "channel": "C05NP90396G",
          "attachments": [
            {
              "blocks": [
                {
                  "type": "header",
                  "text": {
                    "type": "plain_text",
                    "text": "( ╯°▽°)╯ Feedback Form Received!",
                    "emoji": true
                  }
                },
                {
                  "type": "header",
                  "text": {
                    "type": "plain_text",
                    "text": "What they liked",
                    "emoji": true
                  }
                },
                {
                  "type": "context",
                  "elements": [
                    {
                      "type": "plain_text",
                      "text": "<<extract_feedback.positive>>",
                      "emoji": true
                    }
                  ]
                },
                {
                  "type": "header",
                  "text": {
                    "type": "plain_text",
                    "text": "What we can improve",
                    "emoji": true
                  }
                },
                {
                  "type": "context",
                  "elements": [
                    {
                      "type": "plain_text",
                      "text": "<<extract_feedback.negative>>",
                      "emoji": true
                    }
                  ]
                },
                {
                  "type": "header",
                  "text": {
                    "type": "plain_text",
                    "text": "Emoji rating",
                    "emoji": true
                  }
                },
                {
                  "type": "context",
                  "elements": [
                    {
                      "type": "plain_text",
                      "text": "<<extract_feedback.rating>>",
                      "emoji": true
                    }
                  ]
                }
              ]
            }
          ]
        },
        "headers": {
          "Authorization": "Bearer <<CREDENTIAL.hando_s_slack_token>>"
        }
      },
      "reporting": {
        "time_saved_value": 0,
        "time_saved_unit": "minutes"
      },
      "monitoring": {
        "monitor_all_events": false,
        "monitor_failures": false,
        "monitor_no_events_emitted": null
      },
      "template": {
        "created_from_template_guid": null,
        "created_from_template_version": null
      },
      "visuals": {
        "card_icon_image_contents": null,
        "card_icon_image_filename": null,
        "card_icon_name": null
      },
      "width": null,
      "schedule": null
    },
    {
      "type": "Agents::EventTransformationAgent",
      "name": "Extract Feedback",
      "disabled": false,
      "description": null,
      "guid": "ead2103ff79fe0a9eaf597a77f96de8c",
      "origin_story_identifier": "cloud:44e6aef1c1247750fc1a53ae007b2d4c:f8cd1e78465cefe576ca3212e6958674",
      "options": {
        "mode": "message_only",
        "loop": false,
        "payload": {
          "positive": "<<JSONPATH(JSON_PARSE(gotchi_actions.body.payload).state.values, \"*.feedback-pos.value\") |> JOIN(%)>>",
          "negative": "<<JSONPATH(JSON_PARSE(gotchi_actions.body.payload).state.values, \"*.feedback-neg.value\") |> JOIN(%)>>",
          "rating": "<<JSONPATH(JSON_PARSE(gotchi_actions.body.payload).state.values, \"*.feedback-rating.selected_option.text.text\") |> JOIN(%)>>"
        }
      },
      "reporting": {
        "time_saved_value": 0,
        "time_saved_unit": "minutes"
      },
      "monitoring": {
        "monitor_all_events": false,
        "monitor_failures": false,
        "monitor_no_events_emitted": null
      },
      "template": {
        "created_from_template_guid": null,
        "created_from_template_version": null
      },
      "visuals": {
        "card_icon_image_contents": null,
        "card_icon_image_filename": null,
        "card_icon_name": null
      },
      "width": null,
      "schedule": null
    },
    {
      "type": "Agents::HTTPRequestAgent",
      "name": "Ack Form",
      "disabled": false,
      "description": null,
      "guid": "4dd0bb42a23bcec17e932c94a57e29de",
      "origin_story_identifier": "cloud:44e6aef1c1247750fc1a53ae007b2d4c:f8cd1e78465cefe576ca3212e6958674",
      "options": {
        "url": "https://slack.com/api/chat.postMessage",
        "content_type": "application_json",
        "method": "post",
        "payload": {
          "channel": "C05GYNNUEUV",
          "text": "Feedback form sent through! :inbox_tray:"
        },
        "headers": {
          "Authorization": "Bearer <<CREDENTIAL.hando_s_slack_token>>"
        }
      },
      "reporting": {
        "time_saved_value": 0,
        "time_saved_unit": "minutes"
      },
      "monitoring": {
        "monitor_all_events": false,
        "monitor_failures": false,
        "monitor_no_events_emitted": null
      },
      "template": {
        "created_from_template_guid": null,
        "created_from_template_version": null
      },
      "visuals": {
        "card_icon_image_contents": null,
        "card_icon_image_filename": null,
        "card_icon_name": null
      },
      "width": null,
      "schedule": null
    }
  ],
  "diagram_notes": [],
  "links": [
    {
      "source": 1,
      "receiver": 2
    },
    {
      "source": 2,
      "receiver": 11
    },
    {
      "source": 2,
      "receiver": 3
    },
    {
      "source": 2,
      "receiver": 4
    },
    {
      "source": 2,
      "receiver": 9
    },
    {
      "source": 2,
      "receiver": 21
    },
    {
      "source": 3,
      "receiver": 5
    },
    {
      "source": 4,
      "receiver": 6
    },
    {
      "source": 7,
      "receiver": 8
    },
    {
      "source": 8,
      "receiver": 10
    },
    {
      "source": 9,
      "receiver": 7
    },
    {
      "source": 11,
      "receiver": 13
    },
    {
      "source": 12,
      "receiver": 14
    },
    {
      "source": 13,
      "receiver": 12
    },
    {
      "source": 14,
      "receiver": 19
    },
    {
      "source": 15,
      "receiver": 18
    },
    {
      "source": 15,
      "receiver": 16
    },
    {
      "source": 17,
      "receiver": 15
    },
    {
      "source": 19,
      "receiver": 17
    },
    {
      "source": 21,
      "receiver": 23
    },
    {
      "source": 22,
      "receiver": 24
    },
    {
      "source": 23,
      "receiver": 22
    }
  ],
  "diagram_layout": "{\"f56594bb09455a9bbfe28fb4674044dd\":[3885,-765],\"78409ee1354886be98759c34fb8f19d8\":[3885,-675],\"911e33e2e5e0f6aa7fdc17727d49ee70\":[3885,-570],\"7c0171e062fa20e13e7f314c02817a7c\":[4140,-450],\"c8cce34723f25349ab05284f42cea772\":[3630,-450],\"12024dd302b0c48dca74fc5134dbd41e\":[4140,-330],\"0d907a2443bfcb4a744f041732ef2783\":[3630,-330],\"7d86622ae0cbb239993f371d0caa835f\":[4395,-330],\"dfa5fbf726a2293c280dc90c765f0c6b\":[4395,-210],\"38e7095c5d4e855697a73c5bfeba7a86\":[4395,-450],\"633514be86e33b1437bd10eccc91d77f\":[4395,-90],\"2fc043a5db331e161d2d3fb104556ee2\":[3885,-450],\"e904d280d1a86987214d519b6da9e025\":[3885,-210],\"5d0d3385a8f99ddada82764f6d9d8837\":[3885,-330],\"2f9f2e1f867c8b357ff11e9f8a34a8cf\":[3885,-90],\"c8f84b70c3ee5790b924b14e7bd3ced2\":[3885,255],\"92cce79a65d1bd5ea026a200f59b1cef\":[4140,375],\"c0d2e159d3a524623442599f506ec62c\":[3885,135],\"b01da6f1d35a525cbd8861dc0f3c3304\":[3885,375],\"7ed94b46cef3256e7d24508bbd9201af\":[3885,15],\"2453feab937b43dae2cf79dfe3bf2716\":[4170,-765],\"738496c615121dbcd1a3d0f51d77bff0\":[4695,-450],\"2e930cf3b36c069a9aee848bb4f7b56a\":[4695,-225],\"ead2103ff79fe0a9eaf597a77f96de8c\":[4695,-330],\"4dd0bb42a23bcec17e932c94a57e29de\":[4695,-135]}",
  "send_to_story_enabled": false,
  "entry_agent_guid": null,
  "exit_agent_guids": [],
  "exit_agent_guid": null,
  "api_entry_action_guids": [],
  "api_exit_action_guids": [],
  "keep_events_for": 86400,
  "reporting_status": true,
  "send_to_story_access": null,
  "story_library_metadata": {},
  "monitor_failures": false,
  "send_to_stories": [],
  "form": null,
  "synchronous_webhooks_enabled": false,
  "forms": [],
  "pages": [],
  "tags": [],
  "time_saved_unit": "minutes",
  "time_saved_value": 0,
  "origin_story_identifier": "cloud:f10fe9bf2bc3942d032754e35b3b201b:12e3eeb740d3045e3eab7be7263ccd80",
  "integration_product": null,
  "integration_vendor": null,
  "exported_at": "2023-11-28T12:39:27Z",
  "icon": ":memo:",
  "integrations": []
}