{
    "version": 1,
    "disable_existing_loggers": false,
    "formatters": {
        "default": {
            "()": "uvicorn.logging.DefaultFormatter",
            "fmt": "%(levelprefix)s %(message)s",
            "use_colors": null
        },
        "access": {
            "()": "uvicorn.logging.AccessFormatter",
            "fmt": "%(levelprefix)s %(client_addr)s - \"%(request_line)s\" %(status_code)s"
        }
    },
    "handlers": {
        "default": {
            "formatter": "default",
            "class": "logging.StreamHandler",
            "stream": "ext://sys.stderr"
        },
        "access": {
            "formatter": "access",
            "class": "logging.StreamHandler",
            "stream": "ext://sys.stdout"
        }
    },
    "root": {
        "handlers": ["default"],
        "level": "INFO"
    },
    "loggers": {
        "uvicorn": {
            "handlers": ["default"],
            "level": "INFO",
            "propagate": false
        },
        "uvicorn.error": {
            "handlers": ["default"],
            "level": "INFO",
            "propagate": false
        },
        "uvicorn.access": {
            "handlers": ["access"],
            "level": "INFO",
            "propagate": false
        }
    }
}
