[
    [
        "secautotest4@50",
        [
            "INHERITS FROM>https://staging.gitlab.com/secauto-test-hierarchy"
        ]
    ],
    [
        "secautotest0@40",
        [
            "INHERITS FROM>https://staging.gitlab.com/secauto-test-hierarchy/top"
        ]
    ],
    [
        "secautotest1@50",
        [
            "INHERITS FROM>https://staging.gitlab.com/secauto-test-hierarchy/top",
            "WAS SHARED WITH>https://staging.gitlab.com/secauto-test-hierarchy/g1"
        ]
    ],
    [
        "secautotest2@40",
        [
            "INHERITS FROM>https://staging.gitlab.com/secauto-test-hierarchy/top"
        ]
    ],
    [
        "secautotest3@40",
        [
            "INHERITS FROM>https://staging.gitlab.com/secauto-test-hierarchy/top"
        ]
    ],
    [
        "secautotest5@50",
        [
            "INHERITS FROM>https://staging.gitlab.com/secauto-test-hierarchy/top",
            "WAS SHARED WITH>https://staging.gitlab.com/secauto-test-hierarchy/g1"
        ]
    ],
    [
        "secautotest6@50",
        [
            "INHERITS FROM>https://staging.gitlab.com/secauto-test-hierarchy/top",
            "WAS SHARED WITH>https://staging.gitlab.com/secauto-test-hierarchy/g1"
        ]
    ],
    [
        "secautotest8@20",
        [
            "WAS SHARED WITH>https://staging.gitlab.com/secauto-test-hierarchy/g3"
        ]
    ],
    [
        "secautotest7@20",
        [
            "WAS SHARED WITH>https://staging.gitlab.com/secauto-test-hierarchy/g1/g1",
            "WAS SHARED WITH>https://staging.gitlab.com/secauto-test-hierarchy/g1/g2"
        ]
    ]
]