  {
    "$schema": "https://docs.renovatebot.com/renovate-schema.json",
    "extends": [
      "config:base",
      ":automergeMinor",
      ":disableDependencyDashboard",
      ":disableRateLimiting"
    ],
    "labels": [
      "dependencies"
    ],
    "bumpVersion": "patch",
    "assigneesFromCodeOwners": true,
    "lockFileMaintenance": {
      "enabled": true
    }
  }
