{
  "$schema": "https://docs.renovatebot.com/renovate-schema.json",
  "extends": [
    "gitlab>gitlab-com/gl-infra/common-ci-tasks:renovate-common",
    "gitlab>gitlab-com/gl-infra/common-ci-tasks:renovate-truncated-versions",
    ":disableRateLimiting",
    ":semanticCommits",
    ":semanticPrefixFixDepsChoreOthers",
    ":separateMultipleMajorReleases",
    ":separatePatchReleases"
  ],
  "labels": [
    "dependencies"
  ],
  "packageRules": [
    {
      "matchDatasources": [
        "terraform-module"
      ],
      "matchDepTypes": [
        "module"
      ],
      "semanticCommitType": "fix"
    },
    {
      "matchPackageNames": [
        "config-manager"
      ],
      "matchUpdateTypes": [
        "minor",
        "major"
      ],
      "semanticCommitType": "feat"
    },
    {
      "matchPackageNames": [
        "kind",
        "terraform",
        "helm/helm",
        "helm",
        "tfsec-ci"
      ],
      "groupName": "other development dependencies",
      "semanticCommitType": "chore",
      "addLabels": [
        "dependency::dev"
      ]
    },
    {
      "description": "Label updates to major dependencies as a feat:, so we get a new release cut from these updates",
      "matchDatasources": [
        "helm",
        "docker"
      ],
      "matchUpdateTypes": [
        "major",
        "minor"
      ],
      "semanticCommitType": "feat",
      "postUpgradeTasks": {
        "commands": [
          "./scripts/generate-container-manifests.sh"
        ],
        "fileFilters": [
          ".gitlab-container-*.yml"
        ],
        "executionMode": "update"
      }
    },
    {
      "matchDatasources": [
        "helm",
        "docker"
      ],
      "matchUpdateTypes": [
        "patch"
      ],
      "semanticCommitType": "fix",
      "postUpgradeTasks": {
        "commands": [
          "./scripts/generate-container-manifests.sh"
        ],
        "fileFilters": [
          ".gitlab-container-*.yml"
        ],
        "executionMode": "update"
      }
    },
    {
      "description": "Group minor and patch versions into one MR to automerge",
      "matchDepTypes": [
        "devDependencies"
      ],
      "matchUpdateTypes": [
        "minor",
        "patch"
      ],
      "groupName": "dev-minor-updates",
      "automerge": true
    }
  ]
}
