{
  "extends": [
    "config:base",
    ":disableDependencyDashboard",
    ":disableRateLimiting",
    ":semanticCommits",
    ":semanticPrefixFixDepsChoreOthers",
    ":separateMultipleMajorReleases",
    ":separatePatchReleases"
  ],
  "labels": [
    "dependencies"
  ],
  "assigneesFromCodeOwners": true,
  "assigneesSampleSize": 3,
  "packageRules": [
    {
      "matchDatasources": ["terraform-module"],
      "matchDepTypes": ["module"],
      "semanticCommitType": "fix"
    }
  ]
}
