module gitlab.com/gitlab-com/gl-infra/terra-transformer

go 1.23.6

toolchain go1.24.0

require (
	cloud.google.com/go/kms v1.21.0
	github.com/avast/retry-go/v4 v4.6.1
	github.com/aws/aws-sdk-go v1.55.6
	github.com/fatih/color v1.18.0
	github.com/hashicorp/hcl/v2 v2.23.0
	github.com/hashicorp/terraform-json v0.24.0
	github.com/kballard/go-shellquote v0.0.0-20180428030007-95032a82bc51
	github.com/mitchellh/go-wordwrap v1.0.1
	github.com/sethvargo/go-retry v0.3.0
	github.com/spf13/cobra v1.9.1
	github.com/spf13/viper v1.19.0
	github.com/stretchr/testify v1.10.0
	github.com/tmccombs/hcl2json v0.6.5
	google.golang.org/protobuf v1.36.5
	gopkg.in/yaml.v2 v2.4.0
)

require (
	cloud.google.com/go v0.118.2 // indirect
	cloud.google.com/go/auth v0.14.1 // indirect
	cloud.google.com/go/auth/oauth2adapt v0.2.7 // indirect
	cloud.google.com/go/compute/metadata v0.6.0 // indirect
	cloud.google.com/go/iam v1.4.0 // indirect
	cloud.google.com/go/longrunning v0.6.4 // indirect
	github.com/agext/levenshtein v1.2.3 // indirect
	github.com/apparentlymart/go-textseg/v15 v15.0.0 // indirect
	github.com/davecgh/go-spew v1.1.2-0.20180830191138-d8f796af33cc // indirect
	github.com/felixge/httpsnoop v1.0.4 // indirect
	github.com/fsnotify/fsnotify v1.7.0 // indirect
	github.com/go-logr/logr v1.4.2 // indirect
	github.com/go-logr/stdr v1.2.2 // indirect
	github.com/google/s2a-go v0.1.9 // indirect
	github.com/googleapis/enterprise-certificate-proxy v0.3.4 // indirect
	github.com/googleapis/gax-go/v2 v2.14.1 // indirect
	github.com/hashicorp/go-version v1.7.0 // indirect
	github.com/hashicorp/hcl v1.0.0 // indirect
	github.com/inconshreveable/mousetrap v1.1.0 // indirect
	github.com/jmespath/go-jmespath v0.4.0 // indirect
	github.com/magiconair/properties v1.8.7 // indirect
	github.com/mattn/go-colorable v0.1.13 // indirect
	github.com/mattn/go-isatty v0.0.20 // indirect
	github.com/mitchellh/mapstructure v1.5.0 // indirect
	github.com/pelletier/go-toml/v2 v2.2.2 // indirect
	github.com/pmezard/go-difflib v1.0.1-0.20181226105442-5d4384ee4fb2 // indirect
	github.com/sagikazarmark/locafero v0.4.0 // indirect
	github.com/sagikazarmark/slog-shim v0.1.0 // indirect
	github.com/sourcegraph/conc v0.3.0 // indirect
	github.com/spf13/afero v1.11.0 // indirect
	github.com/spf13/cast v1.6.0 // indirect
	github.com/spf13/pflag v1.0.6 // indirect
	github.com/subosito/gotenv v1.6.0 // indirect
	github.com/zclconf/go-cty v1.15.1 // indirect
	go.opentelemetry.io/auto/sdk v1.1.0 // indirect
	go.opentelemetry.io/contrib/instrumentation/google.golang.org/grpc/otelgrpc v0.58.0 // indirect
	go.opentelemetry.io/contrib/instrumentation/net/http/otelhttp v0.58.0 // indirect
	go.opentelemetry.io/otel v1.34.0 // indirect
	go.opentelemetry.io/otel/metric v1.34.0 // indirect
	go.opentelemetry.io/otel/trace v1.34.0 // indirect
	go.uber.org/atomic v1.9.0 // indirect
	go.uber.org/multierr v1.9.0 // indirect
	golang.org/x/crypto v0.33.0 // indirect
	golang.org/x/exp v0.0.0-20230905200255-921286631fa9 // indirect
	golang.org/x/mod v0.22.0 // indirect
	golang.org/x/net v0.35.0 // indirect
	golang.org/x/oauth2 v0.26.0 // indirect
	golang.org/x/sync v0.11.0 // indirect
	golang.org/x/sys v0.30.0 // indirect
	golang.org/x/text v0.22.0 // indirect
	golang.org/x/time v0.10.0 // indirect
	golang.org/x/tools v0.28.0 // indirect
	google.golang.org/api v0.222.0 // indirect
	google.golang.org/genproto v0.0.0-20250122153221-138b5a5a4fd4 // indirect
	google.golang.org/genproto/googleapis/api v0.0.0-20250219182151-9fdb1cabc7b2 // indirect
	google.golang.org/genproto/googleapis/rpc v0.0.0-20250212204824-5a70512c5d8b // indirect
	google.golang.org/grpc v1.70.0 // indirect
	gopkg.in/ini.v1 v1.67.0 // indirect
	gopkg.in/yaml.v3 v3.0.1 // indirect
)
