{
  "defaults": {
    "grafana": {
      "baseURL": "http://localhost:3000"
    },
    "prometheus": {
      "baseURL": "http://localhost:9292",
      "serviceLabel": "type",
      "defaultSelectors": {
        "env": "gprd",
        "stage": "main"
      },
      "queryTemplates": {
        "quantile95_1h": "max(quantile_over_time(0.95, gitlab_component_saturation:ratio{%s}[1h]))",
        "quantile95_1w": "max(gitlab_component_saturation:ratio_quantile95_1w{%s})",
        "quantile99_1w": "max(gitlab_component_saturation:ratio_quantile99_1w{%s})"
      }
    }
  },
  "report": {
    "pages": [
      {
        "path": "api-git-web.md",
        "service_pattern": "api|git|internal-api|web|websockets",
        "title": "API, Git, and Web"
      },
      {
        "path": "ci-runners.md",
        "service_pattern": "ci-runners",
        "title": "CI Runners"
      }
    ]
  },
  "saturationPoints": {
    "cgroup_memory": {
      "appliesTo": [
        "gitaly",
        "praefect"
      ],
      "capacityPlanning": {
        "strategy": "quantile95_1h",
        "forecast_days": 90,
        "historical_days": 365
      },
      "horizontallyScalable": true,
      "slos": {
        "soft": 0.8,
        "hard": 0.9,
        "unkown": "Thing"
      }
    },
    "redis_memory": {
      "appliesTo": [
        "redis-cache",
        "redis-sidekiq",
        "redis"
      ],
      "capacityPlanning": {
        "strategy": "quantile95_1h",
        "forecast_days": 90,
        "historical_days": 365
      },
      "horizontallyScalable": false,
      "slos": {
        "soft": 0.95,
        "hard": 0.99
      }
    },
    "something_excluded": {
      "appliesTo": [
        "gitaly",
        "praefect"
      ],
      "capacityPlanning": {
        "strategy": "exclude"
      },
      "horizontallyScalable": true,
      "slos": {
        "soft": 0.8,
        "hard": 0.9
      }
    }
  },
  "services": {
    "gitaly": {
      "overviewDashboard": {
        "name": "gitaly Service Overview Dashboard",
        "url": "https://dashboards.gitlab.net/d/gitaly-main"
      },
      "resourceDashboard": {
        "cgroup_memory": {
          "name": "gitaly | cgroup_memory resource Dashboard",
          "url": "https://dashboards.gitlab.net/d/alerts-sat_cgroup_memory/?var-environment=gprd&var-type=gitaly&var-stage=main&var-component=cgroup_memory"
        },
        "cpu": {
          "name": "gitaly | cpu resource Dashboard",
          "url": "https://dashboards.gitlab.net/d/alerts-sat_cpu/?var-environment=gprd&var-type=gitaly&var-stage=main&var-component=cpu"
        },
        "disk_inodes": {
          "name": "gitaly | disk_inodes resource Dashboard",
          "url": "https://dashboards.gitlab.net/d/alerts-sat_disk_inodes/?var-environment=gprd&var-type=gitaly&var-stage=main&var-component=disk_inodes"
        },
        "disk_space": {
          "name": "gitaly | disk_space resource Dashboard",
          "url": "https://dashboards.gitlab.net/d/alerts-sat_disk_space/?var-environment=gprd&var-type=gitaly&var-stage=main&var-component=disk_space"
        },
        "disk_sustained_read_iops": {
          "name": "gitaly | disk_sustained_read_iops resource Dashboard",
          "url": "https://dashboards.gitlab.net/d/alerts-sat_disk_sus_read_iops/?var-environment=gprd&var-type=gitaly&var-stage=main&var-component=disk_sustained_read_iops"
        },
        "disk_sustained_read_throughput": {
          "name": "gitaly | disk_sustained_read_throughput resource Dashboard",
          "url": "https://dashboards.gitlab.net/d/alerts-sat_disk_sus_read_throughput/?var-environment=gprd&var-type=gitaly&var-stage=main&var-component=disk_sustained_read_throughput"
        },
        "disk_sustained_write_iops": {
          "name": "gitaly | disk_sustained_write_iops resource Dashboard",
          "url": "https://dashboards.gitlab.net/d/alerts-sat_disk_sus_write_iops/?var-environment=gprd&var-type=gitaly&var-stage=main&var-component=disk_sustained_write_iops"
        },
        "disk_sustained_write_throughput": {
          "name": "gitaly | disk_sustained_write_throughput resource Dashboard",
          "url": "https://dashboards.gitlab.net/d/alerts-sat_disk_sus_write_throughput/?var-environment=gprd&var-type=gitaly&var-stage=main&var-component=disk_sustained_write_throughput"
        },
        "gitaly_active_node_available_space": {
          "name": "gitaly | gitaly_active_node_available_space resource Dashboard",
          "url": "https://dashboards.gitlab.net/d/alerts-sat_gitaly_active_available_space/?var-environment=gprd&var-type=gitaly&var-stage=main&var-component=gitaly_active_node_available_space"
        },
        "gitaly_total_disk_space": {
          "name": "gitaly | gitaly_total_disk_space resource Dashboard",
          "url": "https://dashboards.gitlab.net/d/alerts-sat_gitaly_total_disk_space/?var-environment=gprd&var-type=gitaly&var-stage=main&var-component=gitaly_total_disk_space"
        },
        "go_goroutines": {
          "name": "gitaly | go_goroutines resource Dashboard",
          "url": "https://dashboards.gitlab.net/d/alerts-sat_go_goroutines/?var-environment=gprd&var-type=gitaly&var-stage=main&var-component=go_goroutines"
        },
        "go_memory": {
          "name": "gitaly | go_memory resource Dashboard",
          "url": "https://dashboards.gitlab.net/d/alerts-sat_go_memory/?var-environment=gprd&var-type=gitaly&var-stage=main&var-component=go_memory"
        },
        "memory": {
          "name": "gitaly | memory resource Dashboard",
          "url": "https://dashboards.gitlab.net/d/alerts-sat_memory/?var-environment=gprd&var-type=gitaly&var-stage=main&var-component=memory"
        },
        "nf_conntrack_entries": {
          "name": "gitaly | nf_conntrack_entries resource Dashboard",
          "url": "https://dashboards.gitlab.net/d/alerts-sat_conntrack/?var-environment=gprd&var-type=gitaly&var-stage=main&var-component=nf_conntrack_entries"
        },
        "node_schedstat_waiting": {
          "name": "gitaly | node_schedstat_waiting resource Dashboard",
          "url": "https://dashboards.gitlab.net/d/alerts-sat_node_schedstat_waiting/?var-environment=gprd&var-type=gitaly&var-stage=main&var-component=node_schedstat_waiting"
        },
        "open_fds": {
          "name": "gitaly | open_fds resource Dashboard",
          "url": "https://dashboards.gitlab.net/d/alerts-sat_open_fds/?var-environment=gprd&var-type=gitaly&var-stage=main&var-component=open_fds"
        },
        "shard_cpu": {
          "name": "gitaly | shard_cpu resource Dashboard",
          "url": "https://dashboards.gitlab.net/d/alerts-sat_shard_cpu/?var-environment=gprd&var-type=gitaly&var-stage=main&var-component=shard_cpu"
        },
        "single_node_cpu": {
          "name": "gitaly | single_node_cpu resource Dashboard",
          "url": "https://dashboards.gitlab.net/d/alerts-sat_single_node_cpu/?var-environment=gprd&var-type=gitaly&var-stage=main&var-component=single_node_cpu"
        }
      }
    },
    "praefect": {
      "overviewDashboard": {
        "name": "praefect Service Overview Dashboard",
        "url": "https://dashboards.gitlab.net/d/praefect-main"
      },
      "resourceDashboard": {
        "cgroup_memory": {
          "name": "praefect | cgroup_memory resource Dashboard",
          "url": "https://dashboards.gitlab.net/d/alerts-sat_cgroup_memory/?var-environment=gprd&var-type=praefect&var-stage=main&var-component=cgroup_memory"
        },
        "cloudsql_cpu": {
          "name": "praefect | cloudsql_cpu resource Dashboard",
          "url": "https://dashboards.gitlab.net/d/alerts-sat_cloudsql_cpu/?var-environment=gprd&var-type=praefect&var-stage=main&var-component=cloudsql_cpu"
        },
        "cloudsql_disk": {
          "name": "praefect | cloudsql_disk resource Dashboard",
          "url": "https://dashboards.gitlab.net/d/alerts-sat_cloudsql_disk/?var-environment=gprd&var-type=praefect&var-stage=main&var-component=cloudsql_disk"
        },
        "cloudsql_memory": {
          "name": "praefect | cloudsql_memory resource Dashboard",
          "url": "https://dashboards.gitlab.net/d/alerts-sat_cloudsql_memory/?var-environment=gprd&var-type=praefect&var-stage=main&var-component=cloudsql_memory"
        },
        "cpu": {
          "name": "praefect | cpu resource Dashboard",
          "url": "https://dashboards.gitlab.net/d/alerts-sat_cpu/?var-environment=gprd&var-type=praefect&var-stage=main&var-component=cpu"
        },
        "disk_inodes": {
          "name": "praefect | disk_inodes resource Dashboard",
          "url": "https://dashboards.gitlab.net/d/alerts-sat_disk_inodes/?var-environment=gprd&var-type=praefect&var-stage=main&var-component=disk_inodes"
        },
        "disk_space": {
          "name": "praefect | disk_space resource Dashboard",
          "url": "https://dashboards.gitlab.net/d/alerts-sat_disk_space/?var-environment=gprd&var-type=praefect&var-stage=main&var-component=disk_space"
        },
        "go_goroutines": {
          "name": "praefect | go_goroutines resource Dashboard",
          "url": "https://dashboards.gitlab.net/d/alerts-sat_go_goroutines/?var-environment=gprd&var-type=praefect&var-stage=main&var-component=go_goroutines"
        },
        "go_memory": {
          "name": "praefect | go_memory resource Dashboard",
          "url": "https://dashboards.gitlab.net/d/alerts-sat_go_memory/?var-environment=gprd&var-type=praefect&var-stage=main&var-component=go_memory"
        },
        "memory": {
          "name": "praefect | memory resource Dashboard",
          "url": "https://dashboards.gitlab.net/d/alerts-sat_memory/?var-environment=gprd&var-type=praefect&var-stage=main&var-component=memory"
        },
        "nf_conntrack_entries": {
          "name": "praefect | nf_conntrack_entries resource Dashboard",
          "url": "https://dashboards.gitlab.net/d/alerts-sat_conntrack/?var-environment=gprd&var-type=praefect&var-stage=main&var-component=nf_conntrack_entries"
        },
        "node_schedstat_waiting": {
          "name": "praefect | node_schedstat_waiting resource Dashboard",
          "url": "https://dashboards.gitlab.net/d/alerts-sat_node_schedstat_waiting/?var-environment=gprd&var-type=praefect&var-stage=main&var-component=node_schedstat_waiting"
        },
        "open_fds": {
          "name": "praefect | open_fds resource Dashboard",
          "url": "https://dashboards.gitlab.net/d/alerts-sat_open_fds/?var-environment=gprd&var-type=praefect&var-stage=main&var-component=open_fds"
        },
        "shard_cpu": {
          "name": "praefect | shard_cpu resource Dashboard",
          "url": "https://dashboards.gitlab.net/d/alerts-sat_shard_cpu/?var-environment=gprd&var-type=praefect&var-stage=main&var-component=shard_cpu"
        },
        "single_node_cpu": {
          "name": "praefect | single_node_cpu resource Dashboard",
          "url": "https://dashboards.gitlab.net/d/alerts-sat_single_node_cpu/?var-environment=gprd&var-type=praefect&var-stage=main&var-component=single_node_cpu"
        }
      }
    },
    "redis-cache": {
      "capacityPlanning": {
        "selectors": {
          "env": "anotherenv"
        }
      },
      "overviewDashboard": {
        "name": "redis-cache Service Overview Dashboard",
        "url": "https://dashboards.gitlab.net/d/redis-cache-main"
      },
      "resourceDashboard": {
        "cpu": {
          "name": "redis-cache | cpu resource Dashboard",
          "url": "https://dashboards.gitlab.net/d/alerts-sat_cpu/?var-environment=gprd&var-type=redis-cache&var-stage=main&var-component=cpu"
        }
      }
    },
    "redis-sidekiq": {
      "overviewDashboard": {
        "name": "redis-sidekiq Service Overview Dashboard",
        "url": "https://dashboards.gitlab.net/d/redis-sidekiq-main"
      },
      "resourceDashboard": {
        "cpu": {
          "name": "redis-sidekiq | cpu resource Dashboard",
          "url": "https://dashboards.gitlab.net/d/alerts-sat_cpu/?var-environment=gprd&var-type=redis-sidekiq&var-stage=main&var-component=cpu"
        },
        "disk_inodes": {
          "name": "redis-sidekiq | disk_inodes resource Dashboard",
          "url": "https://dashboards.gitlab.net/d/alerts-sat_disk_inodes/?var-environment=gprd&var-type=redis-sidekiq&var-stage=main&var-component=disk_inodes"
        },
        "disk_space": {
          "name": "redis-sidekiq | disk_space resource Dashboard",
          "url": "https://dashboards.gitlab.net/d/alerts-sat_disk_space/?var-environment=gprd&var-type=redis-sidekiq&var-stage=main&var-component=disk_space"
        },
        "kube_container_cpu": {
          "name": "redis-sidekiq | kube_container_cpu resource Dashboard",
          "url": "https://dashboards.gitlab.net/d/alerts-sat_kube_container_cpu/?var-environment=gprd&var-type=redis-sidekiq&var-stage=main&var-component=kube_container_cpu"
        },
        "kube_container_memory": {
          "name": "redis-sidekiq | kube_container_memory resource Dashboard",
          "url": "https://dashboards.gitlab.net/d/alerts-sat_kube_container_memory/?var-environment=gprd&var-type=redis-sidekiq&var-stage=main&var-component=kube_container_memory"
        },
        "kube_horizontalpodautoscaler_desired_replicas": {
          "name": "redis-sidekiq | kube_horizontalpodautoscaler_desired_replicas resource Dashboard",
          "url": "https://dashboards.gitlab.net/d/alerts-sat_kube_horizontalpodautoscaler/?var-environment=gprd&var-type=redis-sidekiq&var-stage=main&var-component=kube_horizontalpodautoscaler_desired_replicas"
        },
        "kube_pool_cpu": {
          "name": "redis-sidekiq | kube_pool_cpu resource Dashboard",
          "url": "https://dashboards.gitlab.net/d/alerts-sat_kube_pool_cpu/?var-environment=gprd&var-type=redis-sidekiq&var-stage=main&var-component=kube_pool_cpu"
        },
        "kube_pool_max_nodes": {
          "name": "redis-sidekiq | kube_pool_max_nodes resource Dashboard",
          "url": "https://dashboards.gitlab.net/d/alerts-sat_kube_pool_max_nodes/?var-environment=gprd&var-type=redis-sidekiq&var-stage=main&var-component=kube_pool_max_nodes"
        },
        "memory": {
          "name": "redis-sidekiq | memory resource Dashboard",
          "url": "https://dashboards.gitlab.net/d/alerts-sat_memory/?var-environment=gprd&var-type=redis-sidekiq&var-stage=main&var-component=memory"
        },
        "nf_conntrack_entries": {
          "name": "redis-sidekiq | nf_conntrack_entries resource Dashboard",
          "url": "https://dashboards.gitlab.net/d/alerts-sat_conntrack/?var-environment=gprd&var-type=redis-sidekiq&var-stage=main&var-component=nf_conntrack_entries"
        },
        "node_schedstat_waiting": {
          "name": "redis-sidekiq | node_schedstat_waiting resource Dashboard",
          "url": "https://dashboards.gitlab.net/d/alerts-sat_node_schedstat_waiting/?var-environment=gprd&var-type=redis-sidekiq&var-stage=main&var-component=node_schedstat_waiting"
        },
        "open_fds": {
          "name": "redis-sidekiq | open_fds resource Dashboard",
          "url": "https://dashboards.gitlab.net/d/alerts-sat_open_fds/?var-environment=gprd&var-type=redis-sidekiq&var-stage=main&var-component=open_fds"
        },
        "redis_clients": {
          "name": "redis-sidekiq | redis_clients resource Dashboard",
          "url": "https://dashboards.gitlab.net/d/alerts-sat_redis_clients/?var-environment=gprd&var-type=redis-sidekiq&var-stage=main&var-component=redis_clients"
        },
        "redis_memory": {
          "name": "redis-sidekiq | redis_memory resource Dashboard",
          "url": "https://dashboards.gitlab.net/d/alerts-sat_redis_memory/?var-environment=gprd&var-type=redis-sidekiq&var-stage=main&var-component=redis_memory"
        },
        "redis_primary_cpu": {
          "name": "redis-sidekiq | redis_primary_cpu resource Dashboard",
          "url": "https://dashboards.gitlab.net/d/alerts-sat_redis_primary_cpu/?var-environment=gprd&var-type=redis-sidekiq&var-stage=main&var-component=redis_primary_cpu"
        },
        "redis_secondary_cpu": {
          "name": "redis-sidekiq | redis_secondary_cpu resource Dashboard",
          "url": "https://dashboards.gitlab.net/d/alerts-sat_redis_secondary_cpu/?var-environment=gprd&var-type=redis-sidekiq&var-stage=main&var-component=redis_secondary_cpu"
        },
        "shard_cpu": {
          "name": "redis-sidekiq | shard_cpu resource Dashboard",
          "url": "https://dashboards.gitlab.net/d/alerts-sat_shard_cpu/?var-environment=gprd&var-type=redis-sidekiq&var-stage=main&var-component=shard_cpu"
        },
        "single_node_cpu": {
          "name": "redis-sidekiq | single_node_cpu resource Dashboard",
          "url": "https://dashboards.gitlab.net/d/alerts-sat_single_node_cpu/?var-environment=gprd&var-type=redis-sidekiq&var-stage=main&var-component=single_node_cpu"
        }
      }
    },
    "redis": {
      "overviewDashboard": {
        "name": "redis Service Overview Dashboard",
        "url": "https://dashboards.gitlab.net/d/redis-main"
      },
      "resourceDashboard": {
        "cpu": {
          "name": "redis | cpu resource Dashboard",
          "url": "https://dashboards.gitlab.net/d/alerts-sat_cpu/?var-environment=gprd&var-type=redis&var-stage=main&var-component=cpu"
        },
        "disk_inodes": {
          "name": "redis | disk_inodes resource Dashboard",
          "url": "https://dashboards.gitlab.net/d/alerts-sat_disk_inodes/?var-environment=gprd&var-type=redis&var-stage=main&var-component=disk_inodes"
        },
        "disk_space": {
          "name": "redis | disk_space resource Dashboard",
          "url": "https://dashboards.gitlab.net/d/alerts-sat_disk_space/?var-environment=gprd&var-type=redis&var-stage=main&var-component=disk_space"
        },
        "kube_container_cpu": {
          "name": "redis | kube_container_cpu resource Dashboard",
          "url": "https://dashboards.gitlab.net/d/alerts-sat_kube_container_cpu/?var-environment=gprd&var-type=redis&var-stage=main&var-component=kube_container_cpu"
        },
        "kube_container_memory": {
          "name": "redis | kube_container_memory resource Dashboard",
          "url": "https://dashboards.gitlab.net/d/alerts-sat_kube_container_memory/?var-environment=gprd&var-type=redis&var-stage=main&var-component=kube_container_memory"
        },
        "kube_horizontalpodautoscaler_desired_replicas": {
          "name": "redis | kube_horizontalpodautoscaler_desired_replicas resource Dashboard",
          "url": "https://dashboards.gitlab.net/d/alerts-sat_kube_horizontalpodautoscaler/?var-environment=gprd&var-type=redis&var-stage=main&var-component=kube_horizontalpodautoscaler_desired_replicas"
        },
        "kube_pool_cpu": {
          "name": "redis | kube_pool_cpu resource Dashboard",
          "url": "https://dashboards.gitlab.net/d/alerts-sat_kube_pool_cpu/?var-environment=gprd&var-type=redis&var-stage=main&var-component=kube_pool_cpu"
        },
        "kube_pool_max_nodes": {
          "name": "redis | kube_pool_max_nodes resource Dashboard",
          "url": "https://dashboards.gitlab.net/d/alerts-sat_kube_pool_max_nodes/?var-environment=gprd&var-type=redis&var-stage=main&var-component=kube_pool_max_nodes"
        },
        "memory": {
          "name": "redis | memory resource Dashboard",
          "url": "https://dashboards.gitlab.net/d/alerts-sat_memory/?var-environment=gprd&var-type=redis&var-stage=main&var-component=memory"
        },
        "nf_conntrack_entries": {
          "name": "redis | nf_conntrack_entries resource Dashboard",
          "url": "https://dashboards.gitlab.net/d/alerts-sat_conntrack/?var-environment=gprd&var-type=redis&var-stage=main&var-component=nf_conntrack_entries"
        },
        "node_schedstat_waiting": {
          "name": "redis | node_schedstat_waiting resource Dashboard",
          "url": "https://dashboards.gitlab.net/d/alerts-sat_node_schedstat_waiting/?var-environment=gprd&var-type=redis&var-stage=main&var-component=node_schedstat_waiting"
        },
        "open_fds": {
          "name": "redis | open_fds resource Dashboard",
          "url": "https://dashboards.gitlab.net/d/alerts-sat_open_fds/?var-environment=gprd&var-type=redis&var-stage=main&var-component=open_fds"
        },
        "redis_clients": {
          "name": "redis | redis_clients resource Dashboard",
          "url": "https://dashboards.gitlab.net/d/alerts-sat_redis_clients/?var-environment=gprd&var-type=redis&var-stage=main&var-component=redis_clients"
        },
        "redis_memory": {
          "name": "redis | redis_memory resource Dashboard",
          "url": "https://dashboards.gitlab.net/d/alerts-sat_redis_memory/?var-environment=gprd&var-type=redis&var-stage=main&var-component=redis_memory"
        },
        "redis_primary_cpu": {
          "name": "redis | redis_primary_cpu resource Dashboard",
          "url": "https://dashboards.gitlab.net/d/alerts-sat_redis_primary_cpu/?var-environment=gprd&var-type=redis&var-stage=main&var-component=redis_primary_cpu"
        },
        "redis_secondary_cpu": {
          "name": "redis | redis_secondary_cpu resource Dashboard",
          "url": "https://dashboards.gitlab.net/d/alerts-sat_redis_secondary_cpu/?var-environment=gprd&var-type=redis&var-stage=main&var-component=redis_secondary_cpu"
        },
        "shard_cpu": {
          "name": "redis | shard_cpu resource Dashboard",
          "url": "https://dashboards.gitlab.net/d/alerts-sat_shard_cpu/?var-environment=gprd&var-type=redis&var-stage=main&var-component=shard_cpu"
        },
        "single_node_cpu": {
          "name": "redis | single_node_cpu resource Dashboard",
          "url": "https://dashboards.gitlab.net/d/alerts-sat_single_node_cpu/?var-environment=gprd&var-type=redis&var-stage=main&var-component=single_node_cpu"
        }
      }
    }
  },
  "teams": []
}
