{
  "$schema": "https://docs.renovatebot.com/renovate-schema.json",
  "extends": [
    "config:base",
    ":disableDependencyDashboard",
    ":disableRateLimiting",
    ":maintainLockFilesWeekly"
  ],
  "reviewersFromCodeOwners": true,
  "labels": [
    "dependencies"
  ],
  "lockFileMaintenance": {
    "enabled": true
  },
  "packageRules": [
    {
      "matchManagers": ["gitlabci-include"],
      "matchUpdateTypes": ["minor", "patch"],
      "automerge": true,
      "platformAutomerge": true
    }
  ],
  "semanticCommits": "enabled"
}
