{
  "get": {
    "cache:gitlab:rack::attack:allow$NUMBERban:ban:$PATTERN": {
      "value_size": {
        "0": 50704
      },
      "response_size": {
        "0": 50289,
        "107": 289,
        "106": 67,
        "105": 18,
        "2": 10,
        "1": 31
      },
      "unique_key_freq_percentiles": [
        3839,
        1698,
        860,
        544,
        372,
        254,
        162,
        96,
        49,
        21
      ],
      "usages": 50704
    }
  },
  "del": {
    "cache:gitlab:rack::attack:$NUMBER:allow$NUMBERban:count:$PATTERN": {
      "value_size": {
        "0": 47376
      },
      "response_size": {
        "1": 47336,
        "0": 40
      },
      "unique_key_freq_percentiles": [
        3683,
        1620,
        813,
        510,
        350,
        239,
        152,
        92,
        47,
        20
      ],
      "usages": 47376
    },
    "cache:gitlab:rack::attack:allow$NUMBERban:ban:$PATTERN": {
      "value_size": {
        "0": 47375
      },
      "response_size": {
        "1": 47375
      },
      "unique_key_freq_percentiles": [
        3683,
        1620,
        813,
        510,
        350,
        239,
        152,
        92,
        47,
        20
      ],
      "usages": 47375
    }
  },
  "incrby": {
    "cache:gitlab:rack::attack:$NUMBER:allow$NUMBERban:count:$PATTERN": {
      "value_size": {
        "1": 1286
      },
      "response_size": {
        "1": 1178,
        "2": 107,
        "0": 1
      },
      "unique_key_freq_percentiles": [
        129,
        129,
        69,
        49,
        39,
        28,
        19,
        11,
        6,
        2
      ],
      "usages": 1286
    },
    "cache:gitlab:rack::attack:$NUMBER:throttle_authenticated_api:$PATTERN": {
      "value_size": {
        "1": 71064
      },
      "response_size": {
        "3": 22783,
        "2": 23069,
        "4": 5876,
        "1": 19336
      },
      "unique_key_freq_percentiles": [
        5939,
        1896,
        662,
        307,
        163,
        95,
        57,
        39,
        22,
        7
      ],
      "usages": 71064
    },
    "cache:gitlab:rack::attack:$NUMBER:throttle_unauthenticated_api:$PATTERN": {
      "value_size": {
        "1": 18701
      },
      "response_size": {
        "1": 8194,
        "2": 6353,
        "3": 3417,
        "4": 736,
        "0": 1
      },
      "unique_key_freq_percentiles": [
        1871,
        1253,
        645,
        336,
        198,
        122,
        63,
        34,
        17,
        6
      ],
      "usages": 18701
    },
    "cache:gitlab:rack::attack:$NUMBER:throttle_authenticated_web:$PATTERN": {
      "value_size": {
        "1": 41662
      },
      "response_size": {
        "1": 26965,
        "2": 14245,
        "3": 452
      },
      "unique_key_freq_percentiles": [
        2788,
        2083,
        2020,
        1309,
        1002,
        737,
        629,
        495,
        339,
        183
      ],
      "usages": 41662
    },
    "cache:gitlab:rack::attack:$NUMBER:throttle_unauthenticated_web:$PATTERN": {
      "value_size": {
        "1": 12627
      },
      "response_size": {
        "1": 8539,
        "2": 3565,
        "3": 523
      },
      "unique_key_freq_percentiles": [
        1263,
        1136,
        632,
        522,
        333,
        219,
        164,
        100,
        60,
        20
      ],
      "usages": 12627
    },
    "cache:gitlab:rack::attack:$NUMBER:throttle_unauthenticated_protected_paths:$PATTERN": {
      "value_size": {
        "1": 77
      },
      "response_size": {
        "1": 77
      },
      "unique_key_freq_percentiles": [
        8,
        8,
        8,
        7,
        8,
        8,
        7,
        8,
        4,
        2
      ],
      "usages": 77
    }
  },
  "ttl": {
    "cache:gitlab:rack::attack:$NUMBER:allow$NUMBERban:count:$PATTERN": {
      "value_size": {
        "0": 1286
      },
      "response_size": {
        "2": 1285,
        "1": 1
      },
      "unique_key_freq_percentiles": [
        129,
        129,
        69,
        49,
        39,
        28,
        19,
        11,
        6,
        2
      ],
      "usages": 1286
    },
    "cache:gitlab:rack::attack:$NUMBER:throttle_authenticated_api:$PATTERN": {
      "value_size": {
        "0": 71064
      },
      "response_size": {
        "1": 17839,
        "2": 53225
      },
      "unique_key_freq_percentiles": [
        5939,
        1896,
        662,
        307,
        163,
        95,
        57,
        39,
        22,
        7
      ],
      "usages": 71064
    },
    "cache:gitlab:rack::attack:$NUMBER:throttle_unauthenticated_api:$PATTERN": {
      "value_size": {
        "0": 18700
      },
      "response_size": {
        "2": 14025,
        "1": 4675
      },
      "unique_key_freq_percentiles": [
        1870,
        1253,
        646,
        336,
        198,
        122,
        63,
        34,
        17,
        6
      ],
      "usages": 18700
    },
    "cache:gitlab:rack::attack:$NUMBER:throttle_authenticated_web:$PATTERN": {
      "value_size": {
        "0": 41661
      },
      "response_size": {
        "2": 30705,
        "1": 10956
      },
      "unique_key_freq_percentiles": [
        2788,
        2083,
        2020,
        1309,
        1002,
        737,
        629,
        495,
        339,
        183
      ],
      "usages": 41661
    },
    "cache:gitlab:rack::attack:$NUMBER:throttle_unauthenticated_web:$PATTERN": {
      "value_size": {
        "0": 12628
      },
      "response_size": {
        "2": 9931,
        "1": 2696,
        "3": 1
      },
      "unique_key_freq_percentiles": [
        1263,
        1136,
        631,
        523,
        333,
        219,
        164,
        100,
        60,
        20
      ],
      "usages": 12628
    },
    "cache:gitlab:rack::attack:$NUMBER:throttle_unauthenticated_protected_paths:$PATTERN": {
      "value_size": {
        "0": 77
      },
      "response_size": {
        "2": 71,
        "1": 6
      },
      "unique_key_freq_percentiles": [
        8,
        8,
        8,
        7,
        8,
        8,
        7,
        8,
        4,
        2
      ],
      "usages": 77
    }
  },
  "expire": {
    "cache:gitlab:rack::attack:$NUMBER:allow$NUMBERban:count:$PATTERN": {
      "value_size": {
        "0": 669
      },
      "response_size": {
        "1": 668,
        "2": 1
      },
      "unique_key_freq_percentiles": [
        67,
        67,
        56,
        33,
        20,
        12,
        8,
        4,
        3,
        1
      ],
      "usages": 669
    },
    "cache:gitlab:rack::attack:$NUMBER:throttle_unauthenticated_api:$PATTERN": {
      "value_size": {
        "0": 3061
      },
      "response_size": {
        "1": 3061
      },
      "unique_key_freq_percentiles": [
        307,
        306,
        306,
        306,
        306,
        306,
        306,
        306,
        306,
        304
      ],
      "usages": 3061
    },
    "cache:gitlab:rack::attack:$NUMBER:throttle_authenticated_api:$PATTERN": {
      "value_size": {
        "0": 6373
      },
      "response_size": {
        "1": 6373
      },
      "unique_key_freq_percentiles": [
        638,
        637,
        637,
        638,
        637,
        637,
        638,
        637,
        637,
        625
      ],
      "usages": 6373
    },
    "application_rate_limiter:show_raw_controller:project:$NUMBER:$PATTERN": {
      "value_size": {
        "0": 2306
      },
      "response_size": {
        "1": 2306
      },
      "unique_key_freq_percentiles": [
        231,
        231,
        230,
        231,
        197,
        115,
        87,
        63,
        40,
        14
      ],
      "usages": 2306
    },
    "cache:gitlab:rack::attack:$NUMBER:throttle_unauthenticated_web:$PATTERN": {
      "value_size": {
        "0": 3285
      },
      "response_size": {
        "1": 3279,
        "2": 6
      },
      "unique_key_freq_percentiles": [
        329,
        328,
        329,
        328,
        329,
        328,
        329,
        328,
        329,
        321
      ],
      "usages": 3285
    },
    "cache:gitlab:rack::attack:$NUMBER:throttle_authenticated_web:$PATTERN": {
      "value_size": {
        "0": 6891
      },
      "response_size": {
        "1": 6874,
        "2": 17
      },
      "unique_key_freq_percentiles": [
        690,
        689,
        689,
        689,
        689,
        689,
        689,
        689,
        689,
        669
      ],
      "usages": 6891
    },
    "application_rate_limiter:project_download_export:user:$NUMBER:project:$NUMBER:$NUMBER": {
      "value_size": {
        "0": 23
      },
      "response_size": {
        "1": 23
      },
      "unique_key_freq_percentiles": [
        3,
        2,
        2,
        3,
        2,
        2,
        3,
        2,
        2,
        2
      ],
      "usages": 23
    },
    "application_rate_limiter:project_export:user:$NUMBER:$NUMBER": {
      "value_size": {
        "0": 12
      },
      "response_size": {
        "1": 12
      },
      "unique_key_freq_percentiles": [
        2,
        1,
        1,
        0,
        1,
        0,
        0,
        0,
        0,
        0
      ],
      "usages": 12
    },
    "application_rate_limiter:project_import:user:$NUMBER:project_import:$NUMBER": {
      "value_size": {
        "0": 1
      },
      "response_size": {
        "1": 1
      },
      "unique_key_freq_percentiles": [
        1,
        0,
        0,
        0,
        0,
        0,
        0,
        0,
        0,
        0
      ],
      "usages": 1
    },
    "application_rate_limiter:project_repositories_archive:project:$NUMBER:user:$NUMBER:$NUMBER": {
      "value_size": {
        "0": 16
      },
      "response_size": {
        "1": 16
      },
      "unique_key_freq_percentiles": [
        2,
        2,
        1,
        2,
        1,
        2,
        2,
        1,
        2,
        0
      ],
      "usages": 16
    },
    "application_rate_limiter:web_hook_calls:project_hook:$NUMBER:$NUMBER": {
      "value_size": {
        "0": 137
      },
      "response_size": {
        "1": 137
      },
      "unique_key_freq_percentiles": [
        14,
        14,
        14,
        10,
        7,
        6,
        4,
        2,
        2,
        1
      ],
      "usages": 137
    },
    "cache:gitlab:rack::attack:$NUMBER:throttle_unauthenticated_protected_paths:$PATTERN": {
      "value_size": {
        "0": 59
      },
      "response_size": {
        "1": 59
      },
      "unique_key_freq_percentiles": [
        6,
        6,
        6,
        6,
        6,
        6,
        6,
        6,
        6,
        5
      ],
      "usages": 59
    },
    "application_rate_limiter:project_repositories_archive:project:$NUMBER:$NUMBER": {
      "value_size": {
        "0": 18
      },
      "response_size": {
        "1": 18
      },
      "unique_key_freq_percentiles": [
        2,
        2,
        2,
        2,
        1,
        2,
        1,
        1,
        1,
        0
      ],
      "usages": 18
    },
    "application_rate_limiter:notes_create:user:$NUMBER:$NUMBER": {
      "value_size": {
        "0": 13
      },
      "response_size": {
        "1": 13
      },
      "unique_key_freq_percentiles": [
        2,
        1,
        1,
        2,
        1,
        1,
        2,
        1,
        1,
        1
      ],
      "usages": 13
    },
    "application_rate_limiter:issues_create:project:$NUMBER:user:$NUMBER:$NUMBER": {
      "value_size": {
        "0": 5
      },
      "response_size": {
        "1": 5
      },
      "unique_key_freq_percentiles": [
        1,
        0,
        1,
        0,
        1,
        0,
        1,
        0,
        1,
        0
      ],
      "usages": 5
    },
    "application_rate_limiter:web_hook_calls:group_hook:$NUMBER:$NUMBER": {
      "value_size": {
        "0": 10
      },
      "response_size": {
        "1": 10
      },
      "unique_key_freq_percentiles": [
        1,
        0,
        0,
        0,
        1,
        0,
        0,
        0,
        0,
        0
      ],
      "usages": 10
    }
  },
  "incr": {
    "application_rate_limiter:show_raw_controller:project:$NUMBER:$PATTERN": {
      "value_size": {
        "0": 2306
      },
      "response_size": {
        "3": 51,
        "2": 253,
        "1": 2002
      },
      "unique_key_freq_percentiles": [
        231,
        231,
        230,
        231,
        197,
        115,
        87,
        63,
        40,
        14
      ],
      "usages": 2306
    },
    "application_rate_limiter:project_download_export:user:$NUMBER:project:$NUMBER:$NUMBER": {
      "value_size": {
        "0": 23
      },
      "response_size": {
        "1": 23
      },
      "unique_key_freq_percentiles": [
        3,
        2,
        2,
        3,
        2,
        2,
        3,
        2,
        2,
        2
      ],
      "usages": 23
    },
    "application_rate_limiter:project_export:user:$NUMBER:$NUMBER": {
      "value_size": {
        "0": 12
      },
      "response_size": {
        "1": 12
      },
      "unique_key_freq_percentiles": [
        2,
        1,
        1,
        0,
        1,
        0,
        0,
        0,
        0,
        0
      ],
      "usages": 12
    },
    "application_rate_limiter:project_import:user:$NUMBER:project_import:$NUMBER": {
      "value_size": {
        "0": 1
      },
      "response_size": {
        "1": 1
      },
      "unique_key_freq_percentiles": [
        1,
        0,
        0,
        0,
        0,
        0,
        0,
        0,
        0,
        0
      ],
      "usages": 1
    },
    "application_rate_limiter:project_repositories_archive:project:$NUMBER:user:$NUMBER:$NUMBER": {
      "value_size": {
        "0": 16
      },
      "response_size": {
        "1": 16
      },
      "unique_key_freq_percentiles": [
        2,
        2,
        1,
        2,
        1,
        2,
        2,
        1,
        2,
        0
      ],
      "usages": 16
    },
    "application_rate_limiter:web_hook_calls:project_hook:$NUMBER:$NUMBER": {
      "value_size": {
        "0": 137
      },
      "response_size": {
        "1": 134,
        "2": 3
      },
      "unique_key_freq_percentiles": [
        14,
        14,
        14,
        10,
        7,
        6,
        4,
        2,
        2,
        1
      ],
      "usages": 137
    },
    "application_rate_limiter:project_repositories_archive:project:$NUMBER:$NUMBER": {
      "value_size": {
        "0": 18
      },
      "response_size": {
        "1": 18
      },
      "unique_key_freq_percentiles": [
        2,
        2,
        2,
        2,
        1,
        2,
        1,
        1,
        1,
        0
      ],
      "usages": 18
    },
    "application_rate_limiter:notes_create:user:$NUMBER:$NUMBER": {
      "value_size": {
        "0": 13
      },
      "response_size": {
        "1": 13
      },
      "unique_key_freq_percentiles": [
        2,
        1,
        1,
        2,
        1,
        1,
        2,
        1,
        1,
        1
      ],
      "usages": 13
    },
    "application_rate_limiter:issues_create:project:$NUMBER:user:$NUMBER:$NUMBER": {
      "value_size": {
        "0": 5
      },
      "response_size": {
        "1": 5
      },
      "unique_key_freq_percentiles": [
        1,
        0,
        1,
        0,
        1,
        0,
        1,
        0,
        1,
        0
      ],
      "usages": 5
    },
    "application_rate_limiter:web_hook_calls:group_hook:$NUMBER:$NUMBER": {
      "value_size": {
        "0": 10
      },
      "response_size": {
        "2": 6,
        "1": 4
      },
      "unique_key_freq_percentiles": [
        1,
        0,
        0,
        0,
        1,
        0,
        0,
        0,
        0,
        0
      ],
      "usages": 10
    }
  }
}
